cameronraysmith/vanixiets build #1197 failed ← #1196 #1198 →
eval warnings
16 kinds
· 34 occurrences
- warn stdenv.isLinux is deprecated, use stdenv.hostPlatform.isLinux instead ×11
- warn stdenv.isDarwin is deprecated, use stdenv.hostPlatform.isDarwin instead ×9
- warn stdenv.is32bit is deprecated, use stdenv.hostPlatform.is32bit instead ×1
- warn stdenv.is64bit is deprecated, use stdenv.hostPlatform.is64bit instead ×1
- warn stdenv.isAarch32 is deprecated, use stdenv.hostPlatform.isAarch32 instead ×1
- warn stdenv.isAarch64 is deprecated, use stdenv.hostPlatform.isAarch64 instead ×1
- warn stdenv.isBSD is deprecated, use stdenv.hostPlatform.isBSD instead ×1
- warn stdenv.isBigEndian is deprecated, use stdenv.hostPlatform.isBigEndian instead ×1
- warn stdenv.isCygwin is deprecated, use stdenv.hostPlatform.isCygwin instead ×1
- warn stdenv.isFreeBSD is deprecated, use stdenv.hostPlatform.isFreeBSD instead ×1
- warn stdenv.isMips is deprecated, use stdenv.hostPlatform.isMips instead ×1
- warn stdenv.isOpenBSD is deprecated, use stdenv.hostPlatform.isOpenBSD instead ×1
- warn stdenv.isSunOS is deprecated, use stdenv.hostPlatform.isSunOS instead ×1
- warn stdenv.isi686 is deprecated, use stdenv.hostPlatform.isi686 instead ×1
- warn stdenv.isx86_32 is deprecated, use stdenv.hostPlatform.isx86_32 instead ×1
- warn stdenv.isx86_64 is deprecated, use stdenv.hostPlatform.isx86_64 instead ×1
6 failed ⚠ 5
| status | attribute | duration |
|---|---|---|
checks.x86_64-linux.home-manager-crs58
|
5m 47s | |
python3.14-ladybug-0.16.0: | ^~~~~~~~ /build/source/third_party/thrift/transport/TBufferTransports.cpp:120:32: note: ‘uint3 …python3.14-ladybug-0.16.0:
| ^~~~~~~~
/build/source/third_party/thrift/transport/TBufferTransports.cpp:120:32: note: ‘uint32_t’ is defined in header ‘<cstdint>’; this is probably fixable by adding ‘#include <cstdint>’
/build/source/third_party/thrift/transport/TBufferTransports.cpp:128:7: error: ‘uint8_t’ does not name a type
128 | const uint8_t* TMemoryBuffer::borrowSlow(uint8_t* buf, uint32_t* len) {
| ^~~~~~~
/build/source/third_party/thrift/transport/TBufferTransports.cpp:128:7: note: ‘uint8_t’ is defined in header ‘<cstdint>’; this is probably fixable by adding ‘#include <cstdint>’
[212/1057] Building CXX object third_party/antlr4_cypher/CMakeFiles/antlr4_cypher.dir/cypher_parser.cpp.o
ninja: build stopped: subcommand failed.
|
||
checks.x86_64-linux.nixos-cinnabar
|
5m 8s | |
python3.14-ladybug-0.16.0: 27 | uint32_t TProtocol::skip_virt(TType type) { | ^~~~~~~~ /build/source/third_party/thrift/protocol/TProtocol.cpp:21:1: no …python3.14-ladybug-0.16.0:
27 | uint32_t TProtocol::skip_virt(TType type) {
| ^~~~~~~~
/build/source/third_party/thrift/protocol/TProtocol.cpp:21:1: note: ‘uint32_t’ is defined in header ‘<cstdint>’; this is probably fixable by adding ‘#include <cstdint>’
20 | #include "protocol/TProtocol.h"
+++ |+#include <cstdint>
21 |
[216/1057] Building CXX object third_party/antlr4_cypher/CMakeFiles/antlr4_cypher.dir/cypher_parser.cpp.o
ninja: build stopped: subcommand failed.
|
||
checks.x86_64-linux.nixos-electrum
|
5m 25s | |
python3.14-ladybug-0.16.0: | ^~~~~~~~ /build/source/third_party/thrift/transport/TBufferTransports.cpp:120:32: note: ‘uint3 …python3.14-ladybug-0.16.0:
| ^~~~~~~~
/build/source/third_party/thrift/transport/TBufferTransports.cpp:120:32: note: ‘uint32_t’ is defined in header ‘<cstdint>’; this is probably fixable by adding ‘#include <cstdint>’
/build/source/third_party/thrift/transport/TBufferTransports.cpp:128:7: error: ‘uint8_t’ does not name a type
128 | const uint8_t* TMemoryBuffer::borrowSlow(uint8_t* buf, uint32_t* len) {
| ^~~~~~~
/build/source/third_party/thrift/transport/TBufferTransports.cpp:128:7: note: ‘uint8_t’ is defined in header ‘<cstdint>’; this is probably fixable by adding ‘#include <cstdint>’
[214/1057] Building CXX object third_party/antlr4_cypher/CMakeFiles/antlr4_cypher.dir/cypher_parser.cpp.o
ninja: build stopped: subcommand failed.
|
||
checks.x86_64-linux.nixos-galena
|
1m 13s | |
python3.14-ladybug-0.16.0: 27 | uint32_t TProtocol::skip_virt(TType type) { | ^~~~~~~~ /build/source/third_party/thrift/protocol/TProtocol.cpp:21:1: no …python3.14-ladybug-0.16.0:
27 | uint32_t TProtocol::skip_virt(TType type) {
| ^~~~~~~~
/build/source/third_party/thrift/protocol/TProtocol.cpp:21:1: note: ‘uint32_t’ is defined in header ‘<cstdint>’; this is probably fixable by adding ‘#include <cstdint>’
20 | #include "protocol/TProtocol.h"
+++ |+#include <cstdint>
21 |
[217/1057] Building CXX object third_party/antlr4_cypher/CMakeFiles/antlr4_cypher.dir/cypher_parser.cpp.o
ninja: build stopped: subcommand failed.
|
||
checks.x86_64-linux.nixos-magnetite
|
4m 58s | |
python3.14-ladybug-0.16.0: | ^~~~~~~~ /build/source/third_party/thrift/transport/TBufferTransports.cpp:120:32: note: ‘uint3 …python3.14-ladybug-0.16.0:
| ^~~~~~~~
/build/source/third_party/thrift/transport/TBufferTransports.cpp:120:32: note: ‘uint32_t’ is defined in header ‘<cstdint>’; this is probably fixable by adding ‘#include <cstdint>’
/build/source/third_party/thrift/transport/TBufferTransports.cpp:128:7: error: ‘uint8_t’ does not name a type
128 | const uint8_t* TMemoryBuffer::borrowSlow(uint8_t* buf, uint32_t* len) {
| ^~~~~~~
/build/source/third_party/thrift/transport/TBufferTransports.cpp:128:7: note: ‘uint8_t’ is defined in header ‘<cstdint>’; this is probably fixable by adding ‘#include <cstdint>’
[216/1057] Building CXX object third_party/antlr4_cypher/CMakeFiles/antlr4_cypher.dir/cypher_parser.cpp.o
ninja: build stopped: subcommand failed.
|
||
checks.x86_64-linux.nixos-pyrite
|
1m 35s | |
python3.14-ladybug-0.16.0: | ^~~~~~~~ /build/source/third_party/thrift/transport/TBufferTransports.cpp:120:32: note: ‘uint3 …python3.14-ladybug-0.16.0:
| ^~~~~~~~
/build/source/third_party/thrift/transport/TBufferTransports.cpp:120:32: note: ‘uint32_t’ is defined in header ‘<cstdint>’; this is probably fixable by adding ‘#include <cstdint>’
/build/source/third_party/thrift/transport/TBufferTransports.cpp:128:7: error: ‘uint8_t’ does not name a type
128 | const uint8_t* TMemoryBuffer::borrowSlow(uint8_t* buf, uint32_t* len) {
| ^~~~~~~
/build/source/third_party/thrift/transport/TBufferTransports.cpp:128:7: note: ‘uint8_t’ is defined in header ‘<cstdint>’; this is probably fixable by adding ‘#include <cstdint>’
[218/1057] Building CXX object third_party/antlr4_cypher/CMakeFiles/antlr4_cypher.dir/cypher_parser.cpp.o
ninja: build stopped: subcommand failed.
|
||
131 succeeded ⚠ 4
91 already built
| status | attribute | duration |
|---|---|---|
| loading… | ||
7 ignored
| status | attribute | duration |
|---|---|---|
| loading… | ||