clipboard-jh-0.10.0
checks.aarch64-darwin.home-manager-crs58
· build #1198
· raw
unpackPhase
1unpacking source archive /nix/store/i1ws50gam26w911pfavjc2033gx2q5aw-source2source root is sourceconfigurePhase
3cmake flags: -DCMAKE_FIND_USE_SYSTEM_PACKAGE_REGISTRY=OFF -DCMAKE_FIND_USE_PACKAGE_REGISTRY=OFF -DCMAKE_EXPORT_NO_PACKAGE_REGISTRY=ON -DCMAKE_BUILD_TYPE=MinSizeRel -DBUILD_TESTING=OFF -DCMAKE_INSTALL_LOCALEDIR=/nix/store/z34k8qvv10qgk25rrp0rhkaqdfsfjga0-clipboard-jh-0.10.0/share/locale -DCMAKE_INSTALL_LIBEXECDIR=/nix/store/z34k8qvv10qgk25rrp0rhkaqdfsfjga0-clipboard-jh-0.10.0/libexec -DCMAKE_INSTALL_LIBDIR=/nix/store/z34k8qvv10qgk25rrp0rhkaqdfsfjga0-clipboard-jh-0.10.0/lib -DCMAKE_INSTALL_DOCDIR=/nix/store/z34k8qvv10qgk25rrp0rhkaqdfsfjga0-clipboard-jh-0.10.0/share/doc/Clipboard -DCMAKE_INSTALL_INFODIR=/nix/store/z34k8qvv10qgk25rrp0rhkaqdfsfjga0-clipboard-jh-0.10.0/share/info -DCMAKE_INSTALL_MANDIR=/nix/store/z34k8qvv10qgk25rrp0rhkaqdfsfjga0-clipboard-jh-0.10.0/share/man -DCMAKE_INSTALL_INCLUDEDIR=/nix/store/z34k8qvv10qgk25rrp0rhkaqdfsfjga0-clipboard-jh-0.10.0/include -DCMAKE_INSTALL_SBINDIR=/nix/store/z34k8qvv10qgk25rrp0rhkaqdfsfjga0-clipboard-jh-0.10.0/sbin -DCMAKE_INSTALL_BINDIR=/nix/store/z34k8qvv10qgk25rrp0rhkaqdfsfjga0-clipboard-jh-0.10.0/bin -DCMAKE_INSTALL_NAME_DIR=/nix/store/z34k8qvv10qgk25rrp0rhkaqdfsfjga0-clipboard-jh-0.10.0/lib -DCMAKE_STRIP=/nix/store/9kmv76vmbcg21lpy9ki11jq7a2qrwzac-gcc-wrapper-15.3.0/bin/strip -DCMAKE_RANLIB=/nix/store/9kmv76vmbcg21lpy9ki11jq7a2qrwzac-gcc-wrapper-15.3.0/bin/ranlib -DCMAKE_AR=/nix/store/9kmv76vmbcg21lpy9ki11jq7a2qrwzac-gcc-wrapper-15.3.0/bin/ar -DCMAKE_C_COMPILER=gcc -DCMAKE_CXX_COMPILER=g++ -DCMAKE_INSTALL_PREFIX=/nix/store/z34k8qvv10qgk25rrp0rhkaqdfsfjga0-clipboard-jh-0.10.0 -Wno-dev -DINSTALL_PREFIX=/nix/store/z34k8qvv10qgk25rrp0rhkaqdfsfjga0-clipboard-jh-0.10.04The no-dev option is deprecated. Use -Wno-author instead.5-- The CXX compiler identification is GNU 15.3.06-- The C compiler identification is GNU 15.3.07-- Checking whether CXX compiler has -isysroot8-- Checking whether CXX compiler has -isysroot - yes9-- Checking whether CXX compiler supports OSX deployment target flag10-- Checking whether CXX compiler supports OSX deployment target flag - yes11-- Detecting CXX compiler ABI info12-- Detecting CXX compiler ABI info - done13-- Check for working CXX compiler: /nix/store/9kmv76vmbcg21lpy9ki11jq7a2qrwzac-gcc-wrapper-15.3.0/bin/g++ - skipped14-- Detecting CXX compile features15-- Detecting CXX compile features - done16-- Checking whether C compiler has -isysroot17-- Checking whether C compiler has -isysroot - yes18-- Checking whether C compiler supports OSX deployment target flag19-- Checking whether C compiler supports OSX deployment target flag - yes20-- Detecting C compiler ABI info21-- Detecting C compiler ABI info - done22-- Check for working C compiler: /nix/store/9kmv76vmbcg21lpy9ki11jq7a2qrwzac-gcc-wrapper-15.3.0/bin/gcc - skipped23-- Detecting C compile features24-- Detecting C compile features - done25-- Looking for fork26-- Looking for fork - found27-- Could NOT find X11 (missing: X11_X11_INCLUDE_PATH X11_X11_LIB) 28-- Building the Clipboard Project without X11 support29-- Found PkgConfig: /nix/store/nhgylvj98klqggy54h7gbc3b2ia4a00y-pkg-config-wrapper-0.29.2/bin/pkg-config (found version "0.29.2")30-- Checking for modules 'wayland-client;wayland-protocols'31-- No package 'wayland-client' found32-- No package 'wayland-protocols' found33-- Building the Clipboard Project without Wayland support34-- The OBJC compiler identification is GNU 15.3.035-- Checking whether OBJC compiler has -isysroot36-- Checking whether OBJC compiler has -isysroot - yes37-- Checking whether OBJC compiler supports OSX deployment target flag38-- Checking whether OBJC compiler supports OSX deployment target flag - yes39-- Detecting OBJC compiler ABI info40-- Detecting OBJC compiler ABI info - done41-- Check for working OBJC compiler: /nix/store/9kmv76vmbcg21lpy9ki11jq7a2qrwzac-gcc-wrapper-15.3.0/bin/gcc - skipped42-- Performing Test CMAKE_HAVE_LIBC_PTHREAD43-- Performing Test CMAKE_HAVE_LIBC_PTHREAD - Success44-- Found Threads: TRUE45-- Found OpenSSL: /nix/store/m1kwp7bxnlri7nm9x9x8br0d4zlr95f9-openssl-3.5.8/lib/libcrypto.dylib (found version "3.5.8")46-- Configuring done (11.3s)47-- Generating done (0.1s)48CMake Warning (unused-cli):49 Manually-specified variables were not used by the project:5051 BUILD_TESTING52 CMAKE_EXPORT_NO_PACKAGE_REGISTRY53 CMAKE_INSTALL_BINDIR54 CMAKE_INSTALL_DOCDIR55 CMAKE_INSTALL_INCLUDEDIR56 CMAKE_INSTALL_INFODIR57 CMAKE_INSTALL_LIBEXECDIR58 CMAKE_INSTALL_LOCALEDIR59 CMAKE_INSTALL_MANDIR60 CMAKE_INSTALL_SBINDIR61 INSTALL_PREFIX626364-- Build files have been written to: /nix/var/nix/builds/nix-53910-2240609973/source/build65cmake: enabled parallel building66cmake: enabled parallel installingbuildPhase
67build flags: -j18 SHELL=/nix/store/f0b9dbw2gl596cm03pvdsss72381qhlp-bash-5.3p15/bin/bash68[ 6%] Building CXX object src/gui/CMakeFiles/gui.dir/src/infermime.cpp.o69[ 6%] Building CXX object src/gui/CMakeFiles/gui.dir/src/utils.cpp.o70[ 6%] Building CXX object src/gui/CMakeFiles/gui.dir/src/fork.cpp.o71[ 10%] Building CXX object src/gui/CMakeFiles/gui.dir/src/inferextension.cpp.o72[ 10%] Building CXX object src/gui/CMakeFiles/gui.dir/src/gui.cpp.o73[ 12%] Linking CXX static library ../../libgui.a74[ 12%] Built target gui75[ 16%] Building CXX object src/cb/CMakeFiles/cb.dir/src/themes.cpp.o76[ 16%] Building CXX object src/cb/CMakeFiles/cb.dir/src/main.cpp.o77[ 18%] Building CXX object src/cb/CMakeFiles/cb.dir/src/clipboard.cpp.o78[ 20%] Building CXX object src/cb/CMakeFiles/cb.dir/src/indicator.cpp.o79[ 22%] Building CXX object src/cb/CMakeFiles/cb.dir/src/externalclipboards.cpp.o80[ 26%] Building CXX object src/cb/CMakeFiles/cb.dir/src/actions/config.cpp.o81[ 26%] Building CXX object src/cb/CMakeFiles/cb.dir/src/actions/clear.cpp.o82[ 30%] Building CXX object src/cb/CMakeFiles/cb.dir/src/actions/add.cpp.o83[ 30%] Building CXX object src/cb/CMakeFiles/cb.dir/src/actions/export.cpp.o84[ 32%] Building CXX object src/cb/CMakeFiles/cb.dir/src/actions/copy.cpp.o85[ 34%] Building CXX object src/cb/CMakeFiles/cb.dir/src/actions/edit.cpp.o86[ 36%] Building CXX object src/cb/CMakeFiles/cb.dir/src/actions/history.cpp.o87[ 38%] Building CXX object src/cb/CMakeFiles/cb.dir/src/actions/import.cpp.o88[ 40%] Building CXX object src/cb/CMakeFiles/cb.dir/src/actions/load.cpp.o89[ 42%] Building CXX object src/cb/CMakeFiles/cb.dir/src/actions/info.cpp.o90[ 46%] Building CXX object src/cb/CMakeFiles/cb.dir/src/actions/ignore.cpp.o91[ 46%] Building CXX object src/cb/CMakeFiles/cb.dir/src/actions/note.cpp.o92[ 48%] Building CXX object src/cb/CMakeFiles/cb.dir/src/actions/paste.cpp.o93g++: error: unrecognized command-line option '-fobjc-arc'; did you mean '-fobjc-gc'?94make[2]: *** [src/cb/CMakeFiles/cb.dir/build.make:93: src/cb/CMakeFiles/cb.dir/src/main.cpp.o] Error 195make[2]: *** Waiting for unfinished jobs....96g++: error: unrecognized command-line option '-fobjc-arc'; did you mean '-fobjc-gc'?97make[2]: *** [src/cb/CMakeFiles/cb.dir/build.make:107: src/cb/CMakeFiles/cb.dir/src/themes.cpp.o] Error 198g++: error: unrecognized command-line option '-fobjc-arc'; did you mean '-fobjc-gc'?99g++: error: unrecognized command-line option '-fobjc-arc'; did you mean '-fobjc-gc'?100g++: error: unrecognized command-line option '-fobjc-arc'; did you mean '-fobjc-gc'?101make[2]: *** [src/cb/CMakeFiles/cb.dir/build.make:149: src/cb/CMakeFiles/cb.dir/src/actions/add.cpp.o] Error 1102make[2]: *** [src/cb/CMakeFiles/cb.dir/build.make:289: src/cb/CMakeFiles/cb.dir/src/actions/load.cpp.o] Error 1103g++: error: unrecognized command-line option '-fobjc-arc'; did you mean '-fobjc-gc'?104g++: error: unrecognized command-line option '-fobjc-arc'; did you mean '-fobjc-gc'?105make[2]: *** [src/cb/CMakeFiles/cb.dir/build.make:121: src/cb/CMakeFiles/cb.dir/src/indicator.cpp.o] Error 1106make[2]: *** [src/cb/CMakeFiles/cb.dir/build.make:261: src/cb/CMakeFiles/cb.dir/src/actions/import.cpp.o] Error 1107make[2]: *** [src/cb/CMakeFiles/cb.dir/build.make:233: src/cb/CMakeFiles/cb.dir/src/actions/history.cpp.o] Error 1108g++: error: unrecognized command-line option '-fobjc-arc'; did you mean '-fobjc-gc'?109make[2]: *** [src/cb/CMakeFiles/cb.dir/build.make:177: src/cb/CMakeFiles/cb.dir/src/actions/config.cpp.o] Error 1110g++: error: unrecognized command-line option '-fobjc-arc'; did you mean '-fobjc-gc'?111g++: error: unrecognized command-line option '-fobjc-arc'; did you mean '-fobjc-gc'?112make[2]: *** [src/cb/CMakeFiles/cb.dir/build.make:219: src/cb/CMakeFiles/cb.dir/src/actions/export.cpp.o] Error 1113make[2]: *** [src/cb/CMakeFiles/cb.dir/build.make:79: src/cb/CMakeFiles/cb.dir/src/clipboard.cpp.o] Error 1114g++: error: unrecognized command-line option '-fobjc-arc'; did you mean '-fobjc-gc'?115g++: error: unrecognized command-line option '-fobjc-arc'; did you mean '-fobjc-gc'?116make[2]: *** [src/cb/CMakeFiles/cb.dir/build.make:163: src/cb/CMakeFiles/cb.dir/src/actions/clear.cpp.o] Error 1117make[2]: *** [src/cb/CMakeFiles/cb.dir/build.make:247: src/cb/CMakeFiles/cb.dir/src/actions/ignore.cpp.o] Error 1118g++: error: unrecognized command-line option '-fobjc-arc'; did you mean '-fobjc-gc'?119g++: error: unrecognized command-line option '-fobjc-arc'; did you mean '-fobjc-gc'?120make[2]: *** [src/cb/CMakeFiles/cb.dir/build.make:191: src/cb/CMakeFiles/cb.dir/src/actions/copy.cpp.o] Error 1121make[2]: *** [src/cb/CMakeFiles/cb.dir/build.make:135: src/cb/CMakeFiles/cb.dir/src/externalclipboards.cpp.o] Error 1122g++: error: unrecognized command-line option '-fobjc-arc'; did you mean '-fobjc-gc'?123make[2]: *** [src/cb/CMakeFiles/cb.dir/build.make:303: src/cb/CMakeFiles/cb.dir/src/actions/note.cpp.o] Error 1124g++: error: unrecognized command-line option '-fobjc-arc'; did you mean '-fobjc-gc'?125make[2]: *** [src/cb/CMakeFiles/cb.dir/build.make:275: src/cb/CMakeFiles/cb.dir/src/actions/info.cpp.o] Error 1126g++: error: unrecognized command-line option '-fobjc-arc'; did you mean '-fobjc-gc'?127make[2]: *** [src/cb/CMakeFiles/cb.dir/build.make:317: src/cb/CMakeFiles/cb.dir/src/actions/paste.cpp.o] Error 1128g++: error: unrecognized command-line option '-fobjc-arc'; did you mean '-fobjc-gc'?129make[2]: *** [src/cb/CMakeFiles/cb.dir/build.make:205: src/cb/CMakeFiles/cb.dir/src/actions/edit.cpp.o] Error 1130make[1]: *** [CMakeFiles/Makefile2:161: src/cb/CMakeFiles/cb.dir/all] Error 2131make: *** [Makefile:136: all] Error 2