nixbot

builds

cameronraysmith/vanixiets build #1381 failed

branch main · PR #3416 · commit 83e63d9454 · · took 2h 47m · eval 4m 23s

eval warnings 3 kinds · 7 occurrences
  • error ×4
  • error snd-hda-macbookpro: only Linux 6.18.55 has been checked; revalidate the source/header layout and module selection before changing this boundary ×2
  • warn stdenv.isLinux is deprecated, use stdenv.hostPlatform.isLinux instead ×1

6 failed
failed attributes
status attribute duration
failed checks.aarch64-darwin.home-manager-tara 2h 23m
internal error, see service logs
internal error, see service logs
failed checks.x86_64-linux.home-manager-christophersmith 1m 22s
direnv-instant-1.3.0: ---- empty_export_preserves_cache stdout ---- thread 'empty_export_preserves_cache' (992) panicked at tests/empty_export_preserves_cache.r …
direnv-instant-1.3.0:
---- empty_export_preserves_cache stdout ----
thread 'empty_export_preserves_cache' (992) panicked at tests/empty_export_preserves_cache.rs:26:5:
env file not created
note: run with `RUST_BACKTRACE=1` environment variable to display a backtrace
failures:
    empty_export_preserves_cache
test result: FAILED. 0 passed; 1 failed; 0 ignored; 0 measured; 0 filtered out; finished in 30.02s
error: test failed, to rerun pass `--test empty_export_preserves_cache`
failed checks.x86_64-linux.nixos-magnetite 6m 19s
source-patched-source: unpacking source archive /nix/store/y9pjvm4dipli0lhfvjf96gwqjwmabigq-source source root is source applying patch /nix/store/7xizjmaxpcgg1 …
source-patched-source:
unpacking source archive /nix/store/y9pjvm4dipli0lhfvjf96gwqjwmabigq-source
source root is source
applying patch /nix/store/7xizjmaxpcgg17qwvs74193hi024dys2-30820a54b112f4842bdb7df28b61b2a607e54033.patch
patching file src/libfetchers/fetch-to-store.cc
Reversed (or previously applied) patch detected!  Assume -R? [n] 
Apply anyway? [n] 
Skipping patch.
1 out of 1 hunk ignored -- saving rejects to file src/libfetchers/fetch-to-store.cc.rej
failed eval checks.x86_64-linux.nixos-pyrite —
error: … while evaluating a branch condition at «string»:25:5: 24| v: 25| if !builtins.isAttrs v || isDrv v then …
error:
       … while evaluating a branch condition
         at «string»:25:5:
           24|     v:
           25|     if !builtins.isAttrs v || isDrv v then
             |     ^
           26|       v

       … in the left operand of the OR (||) operator
         at «string»:25:28:
           24|     v:
           25|     if !builtins.isAttrs v || isDrv v then
             |                            ^
           26|       v

       … while evaluating definitions from `/nix/store/6xr58mfvs42ixw6428x3vm9l5h88l2z7-source/modules/transposition.nix':

       … while evaluating definitions from `/nix/store/9b2swqjsprmsgzswk2rwv8cg3ng3gwr5-source/modules/checks/machines.nix, via option perSystem':

       … while evaluating the option `system.build.toplevel':

       … while evaluating definitions from `/nix/store/jh54b1v8nqkwrhw9b6a6zf2f4ff020ka-source/nixos/modules/system/activation/top-level.nix':

       (stack trace truncated; use '--show-trace' to show the full, detailed trace)

       error:
       Failed assertions:
       - pyrite desktop: native package identities and configuration pins
failed eval checks.x86_64-linux.pyrite-audio —
error: … while evaluating a branch condition at «string»:25:5: 24| v: 25| if !builtins.isAttrs v || isDrv v then …
error:
       … while evaluating a branch condition
         at «string»:25:5:
           24|     v:
           25|     if !builtins.isAttrs v || isDrv v then
             |     ^
           26|       v

       … in the left operand of the OR (||) operator
         at «string»:25:28:
           24|     v:
           25|     if !builtins.isAttrs v || isDrv v then
             |                            ^
           26|       v

       … while evaluating definitions from `/nix/store/6xr58mfvs42ixw6428x3vm9l5h88l2z7-source/modules/transposition.nix':

       … while evaluating definitions from `/nix/store/9b2swqjsprmsgzswk2rwv8cg3ng3gwr5-source/modules/checks/pyrite-audio.nix, via option perSystem':

       … while evaluating the option `boot.extraModulePackages':

       … while evaluating definitions from `/nix/store/9b2swqjsprmsgzswk2rwv8cg3ng3gwr5-source/modules/machines/nixos/pyrite/default.nix, via option flake.modules.nixos."machines/nixos/pyrite"':

       (stack trace truncated; use '--show-trace' to show the full, detailed trace)

       error: snd-hda-macbookpro: only Linux 6.18.55 has been checked; revalidate the source/header layout and module selection before changing this boundary
failed eval checks.x86_64-linux.pyrite-bluetooth —
error: … while evaluating a branch condition at «string»:25:5: 24| v: 25| if !builtins.isAttrs v || isDrv v then …
error:
       … while evaluating a branch condition
         at «string»:25:5:
           24|     v:
           25|     if !builtins.isAttrs v || isDrv v then
             |     ^
           26|       v

       … in the left operand of the OR (||) operator
         at «string»:25:28:
           24|     v:
           25|     if !builtins.isAttrs v || isDrv v then
             |                            ^
           26|       v

       … while evaluating definitions from `/nix/store/6xr58mfvs42ixw6428x3vm9l5h88l2z7-source/modules/transposition.nix':

       … while evaluating definitions from `/nix/store/9b2swqjsprmsgzswk2rwv8cg3ng3gwr5-source/modules/checks/pyrite-bluetooth.nix, via option perSystem':

       … while evaluating the option `boot.extraModulePackages':

       … while evaluating definitions from `/nix/store/9b2swqjsprmsgzswk2rwv8cg3ng3gwr5-source/modules/machines/nixos/pyrite/default.nix, via option flake.modules.nixos."machines/nixos/pyrite"':

       (stack trace truncated; use '--show-trace' to show the full, detailed trace)

       error: snd-hda-macbookpro: only Linux 6.18.55 has been checked; revalidate the source/header layout and module selection before changing this boundary
51 succeeded ⚠ 1
succeeded attributes
status attribute duration
succeeded checks.x86_64-linux.nixos-cinnabar
  • stdenv.isLinux is deprecated, use stdenv.hostPlatform.isLinux instead
6m 30s
succeeded checks.aarch64-darwin.apps-build 9m 6s
succeeded checks.aarch64-darwin.devshell-default 23m 1s
succeeded checks.aarch64-darwin.gitleaks 22m 6s
succeeded checks.aarch64-darwin.jj-pr-tags-rehearsal 26m 59s
succeeded checks.aarch64-darwin.omnigent-worker-capabilities 47s
succeeded checks.aarch64-darwin.omnigent-worker-darwin 3m 34s
succeeded checks.aarch64-darwin.package-gh-axi 0s
succeeded checks.aarch64-darwin.package-ghq-sync 9m 17s
succeeded checks.aarch64-darwin.package-impressive 3m 52s
succeeded checks.aarch64-darwin.package-omnigent 26m 57s
succeeded checks.aarch64-darwin.package-ouroboros 23m 49s
succeeded checks.aarch64-darwin.package-repo-sync 23m 54s
succeeded checks.aarch64-darwin.package-stack-land 1s
succeeded checks.aarch64-darwin.package-stack-land-test-integration 0s
succeeded checks.aarch64-darwin.package-tmux-command-palette 1m 5s
succeeded checks.x86_64-linux.apps-build 6s
succeeded checks.x86_64-linux.deploy-docs-rehearsal 1m 27s
succeeded checks.x86_64-linux.devshell-default 17s
succeeded checks.x86_64-linux.devshell-terraform 14s
succeeded checks.x86_64-linux.eval-agents-md 7s
succeeded checks.x86_64-linux.eval-md-format 6s
succeeded checks.x86_64-linux.eval-users-lib 6s
succeeded checks.x86_64-linux.gitleaks 4s
succeeded checks.x86_64-linux.home-manager-crs58 3m 29s
succeeded checks.x86_64-linux.home-manager-janettesmith 2m 24s
succeeded checks.x86_64-linux.home-manager-raquel 2m 41s
succeeded checks.x86_64-linux.home-manager-ubuntu 1m 22s
succeeded checks.x86_64-linux.jj-pr-tags-rehearsal 10s
succeeded checks.x86_64-linux.nixos-electrum 7m 35s
succeeded checks.x86_64-linux.nixos-galena 8m 15s
succeeded checks.x86_64-linux.omnigent-worker-capabilities 1m 0s
succeeded checks.x86_64-linux.omnigent-worker-linux 37s
succeeded checks.x86_64-linux.package-atuin-format 45s
succeeded checks.x86_64-linux.package-gh-axi 41s
succeeded checks.x86_64-linux.package-ghq-sync 6s
succeeded checks.x86_64-linux.package-impressive 1s
succeeded checks.x86_64-linux.package-omnigent 5s
succeeded checks.x86_64-linux.package-ouroboros 5s
succeeded checks.x86_64-linux.package-repo-sync 5s
succeeded checks.x86_64-linux.package-stack-land 1s
succeeded checks.x86_64-linux.package-stack-land-test-integration 35s
succeeded checks.x86_64-linux.package-terraform 39s
succeeded checks.x86_64-linux.package-tmux-command-palette 0s
succeeded checks.x86_64-linux.pi-agent-environment-smoke 39s
succeeded checks.x86_64-linux.publish-evidence-rehearsal 1m 56s
succeeded checks.x86_64-linux.pyrite-dankgreeter-config 39s
succeeded checks.x86_64-linux.renovate-config 35s
succeeded checks.x86_64-linux.rgContainer-aarch64 2m 15s
succeeded checks.x86_64-linux.terraform-validate 44s
succeeded checks.x86_64-linux.treefmt 44s
167 already built
skipped attributes
status attribute duration
loading…
11 ignored
ignored attributes
status attribute duration
loading…
effecttrigger when
Done
succeeded browser-evidence event build_finished · 8s
succeeded docs event pull_request_closed · 15s