nixbot

builds

cameronraysmith/vanixiets build #1970 failed

branch main · PR #3565 · commit ab8a293b95 · · took 5m 58s · eval 3m 35s

5 failed
failed attributes
status attribute duration
dependency failed checks.x86_64-linux.package-vanixiets-docs-test-e2e —
failed checks.x86_64-linux.package-vanixiets-docs-test-e2e-action-negative-control 2m 15s
vanixiets-docs-e2e-action-negative-report-0.0.0-development: [WebServer] at async #assembleAndUpdateConfig (/build/source/node_modules/.bun/miniflare@5.2026 …
vanixiets-docs-e2e-action-negative-report-0.0.0-development:
[WebServer]     at async #assembleAndUpdateConfig (/build/source/node_modules/.bun/miniflare@5.20261023.1-beta+54bb80aa5fe8cac3/node_modules/miniflare/dist/src/index.js:138996:7)
[WebServer]     at async /build/source/node_modules/.bun/miniflare@5.20261023.1-beta+54bb80aa5fe8cac3/node_modules/miniflare/dist/src/index.js:137895:7
[WebServer]     at async Mutex.runWith (/build/source/node_modules/.bun/miniflare@5.20261023.1-beta+54bb80aa5fe8cac3/node_modules/miniflare/dist/src/index.js:80854:16)
[WebServer]     at async #waitForReady (/build/source/node_modules/.bun/miniflare@5.20261023.1-beta+54bb80aa5fe8cac3/node_modules/miniflare/dist/src/index.js:139210:5)
[WebServer]     at async _Miniflare.dispatchFetch (/build/source/node_modules/.bun/miniflare@5.20261023.1-beta+54bb80aa5fe8cac3/node_modules/miniflare/dist/src/index.js:139376:5)
[WebServer]     at async file:///build/source/node_modules/.bun/@cloudflare+vite-plugin@1.66.0+1e62ff67e2909857/node_modules/@cloudflare/vite-plugin/dist/index.mjs:56866:19
Error: Timed out waiting 120000ms from config.webServer.
Invalid Playwright evidence: runner infrastructure error
failed checks.x86_64-linux.package-vanixiets-docs-test-e2e-negative-control 2m 16s
vanixiets-docs-e2e-negative-report-0.0.0-development: [WebServer] at async #assembleAndUpdateConfig (/build/source/node_modules/.bun/miniflare@5.20261023.1- …
vanixiets-docs-e2e-negative-report-0.0.0-development:
[WebServer]     at async #assembleAndUpdateConfig (/build/source/node_modules/.bun/miniflare@5.20261023.1-beta+54bb80aa5fe8cac3/node_modules/miniflare/dist/src/index.js:138996:7)
[WebServer]     at async /build/source/node_modules/.bun/miniflare@5.20261023.1-beta+54bb80aa5fe8cac3/node_modules/miniflare/dist/src/index.js:137895:7
[WebServer]     at async Mutex.runWith (/build/source/node_modules/.bun/miniflare@5.20261023.1-beta+54bb80aa5fe8cac3/node_modules/miniflare/dist/src/index.js:80854:16)
[WebServer]     at async #waitForReady (/build/source/node_modules/.bun/miniflare@5.20261023.1-beta+54bb80aa5fe8cac3/node_modules/miniflare/dist/src/index.js:139210:5)
[WebServer]     at async _Miniflare.dispatchFetch (/build/source/node_modules/.bun/miniflare@5.20261023.1-beta+54bb80aa5fe8cac3/node_modules/miniflare/dist/src/index.js:139376:5)
[WebServer]     at async file:///build/source/node_modules/.bun/@cloudflare+vite-plugin@1.66.0+1e62ff67e2909857/node_modules/@cloudflare/vite-plugin/dist/index.mjs:56866:19
Error: Timed out waiting 120000ms from config.webServer.
Invalid Playwright evidence: runner infrastructure error
failed checks.x86_64-linux.package-vanixiets-docs-test-e2e-report 22s
vanixiets-docs-e2e-report-0.0.0-development: [WebServer] code: 'ERR_RUNTIME_FAILURE', [WebServer] cause: undefined [WebServer] } [WebServer] [WebServer] No …
vanixiets-docs-e2e-report-0.0.0-development:
[WebServer]   code: 'ERR_RUNTIME_FAILURE',
[WebServer]   cause: undefined
[WebServer] }
[WebServer] 
[WebServer] Node.js v24.21.0
[WebServer] error: script "preview:ci" exited with code 1
Error: Process from config.webServer was not able to start. Exit code: 1
Invalid Playwright evidence: runner infrastructure error
failed checks.x86_64-linux.package-vanixiets-docs-test-e2e-webkit-negative-control 22s
vanixiets-docs-e2e-webkit-negative-report-0.0.0-development: [WebServer] code: 'ERR_RUNTIME_FAILURE', [WebServer] cause: undefined [WebServer] } [WebServer] …
vanixiets-docs-e2e-webkit-negative-report-0.0.0-development:
[WebServer]   code: 'ERR_RUNTIME_FAILURE',
[WebServer]   cause: undefined
[WebServer] }
[WebServer] 
[WebServer] Node.js v24.21.0
[WebServer] error: script "preview:ci" exited with code 1
Error: Process from config.webServer was not able to start. Exit code: 1
Invalid Playwright evidence: runner infrastructure error
44 succeeded
succeeded attributes
status attribute duration
loading…
207 already built
skipped attributes
status attribute duration
loading…
effecttrigger when
Needs attention
failed browser-evidence event build_finished · 8s
=== publish-evidence (build 1970 at ab8a293b95d4, failed) === error: evidence unavailable: nixbot build 1970 attribute checks.x86_64-linux.package-vanixiets-doc …
=== publish-evidence (build 1970 at ab8a293b95d4, failed) ===
error: evidence unavailable: nixbot build 1970 attribute checks.x86_64-linux.package-vanixiets-docs-test-e2e-report is "failed"
error: nix failed with exit code 1