nixbot

builds

cameronraysmith/vanixiets build #458 failed

branch main · PR #3062 · commit 99b34600a0 · · took 1h 23m

eval warnings 4 kinds · 1416 occurrences
  • error ×12
  • error Go 1.25 is end-of-life, and 'buildGo125Module' has been removed. Please use a newer builder version. ×12
  • warn stdenv.isLinux is deprecated, use stdenv.hostPlatform.isLinux instead ×692
  • warn stdenv.isDarwin is deprecated, use stdenv.hostPlatform.isDarwin instead ×700

15 failed
failed attributes
status attribute duration
failed eval checks.x86_64-linux.home-manager-cameron —
error: … while calling the 'derivationStrict' builtin at «nix-internal»/derivation-internal.nix:37:12: 36| 37| strict = …
error:
       … while calling the 'derivationStrict' builtin
         at «nix-internal»/derivation-internal.nix:37:12:
           36|
           37|   strict = derivationStrict drvAttrs;
             |            ^
           38|

       … while evaluating derivation 'home-manager-generation'
         whose name attribute is located at «https://releases.nixos.org/nixos/unstable-small/nixos-26.11pre1074459.418b43648094/nixexprs.tar.xz?narHash=sha256-Cs/wIcIPlbW1YLAZ7KoLP7KPuDqv%2Bsuw0Njzg1CAlNo%3D»/pkgs/stdenv/generic/make-derivation.nix:651:11

       … while evaluating attribute 'buildCommand' of derivation 'home-manager-generation'
         at «https://releases.nixos.org/nixos/unstable-small/nixos-26.11pre1074459.418b43648094/nixexprs.tar.xz?narHash=sha256-Cs/wIcIPlbW1YLAZ7KoLP7KPuDqv%2Bsuw0Njzg1CAlNo%3D»/pkgs/build-support/trivial-builders/default.nix:88:9:
           87|         inherit name;
           88|         buildCommand = lib.toFunction buildCommand finalAttrs;
             |         ^
           89|         passAsFile = defaultPassAsFile ++ (userAttrs.passAsFile or [ ]);

       … while evaluating the option `home.file."/home/cameron/.config/systemd/user/sops-nix.service".source':

       … while evaluating definitions from `/nix/store/5va9gi755mjcgksmybwy18k950shqsvx-source/modules/misc/xdg':

       … while evaluating the option `xdg.configFile."systemd/user/sops-nix.service".source':

       … while evaluating definitions from `/nix/store/5va9gi755mjcgksmybwy18k950shqsvx-source/modules/systemd.nix':

       … while evaluating the option `systemd.user.services.sops-nix.Service.ExecStart':

       … while evaluating definitions from `/nix/store/lvnl7lflsi8gvn2b4pdjmyiwxvp6sn6m-source/modules/home-manager/sops.nix':

       … while evaluating the option `sops.package':

       (stack trace truncated; use '--show-trace' to show the full, detailed trace)

       error: Go 1.25 is end-of-life, and 'buildGo125Module' has been removed. Please use a newer builder version.
failed eval checks.x86_64-linux.home-manager-christophersmith —
error: … while calling the 'derivationStrict' builtin at «nix-internal»/derivation-internal.nix:37:12: 36| 37| strict = …
error:
       … while calling the 'derivationStrict' builtin
         at «nix-internal»/derivation-internal.nix:37:12:
           36|
           37|   strict = derivationStrict drvAttrs;
             |            ^
           38|

       … while evaluating derivation 'home-manager-generation'
         whose name attribute is located at «https://releases.nixos.org/nixos/unstable-small/nixos-26.11pre1074459.418b43648094/nixexprs.tar.xz?narHash=sha256-Cs/wIcIPlbW1YLAZ7KoLP7KPuDqv%2Bsuw0Njzg1CAlNo%3D»/pkgs/stdenv/generic/make-derivation.nix:651:11

       … while evaluating attribute 'buildCommand' of derivation 'home-manager-generation'
         at «https://releases.nixos.org/nixos/unstable-small/nixos-26.11pre1074459.418b43648094/nixexprs.tar.xz?narHash=sha256-Cs/wIcIPlbW1YLAZ7KoLP7KPuDqv%2Bsuw0Njzg1CAlNo%3D»/pkgs/build-support/trivial-builders/default.nix:88:9:
           87|         inherit name;
           88|         buildCommand = lib.toFunction buildCommand finalAttrs;
             |         ^
           89|         passAsFile = defaultPassAsFile ++ (userAttrs.passAsFile or [ ]);

       … while evaluating the option `home.file."/home/christophersmith/.config/systemd/user/sops-nix.service".source':

       … while evaluating definitions from `/nix/store/5va9gi755mjcgksmybwy18k950shqsvx-source/modules/misc/xdg':

       … while evaluating the option `xdg.configFile."systemd/user/sops-nix.service".source':

       … while evaluating definitions from `/nix/store/5va9gi755mjcgksmybwy18k950shqsvx-source/modules/systemd.nix':

       … while evaluating the option `systemd.user.services.sops-nix.Service.ExecStart':

       … while evaluating definitions from `/nix/store/lvnl7lflsi8gvn2b4pdjmyiwxvp6sn6m-source/modules/home-manager/sops.nix':

       … while evaluating the option `sops.package':

       (stack trace truncated; use '--show-trace' to show the full, detailed trace)

       error: Go 1.25 is end-of-life, and 'buildGo125Module' has been removed. Please use a newer builder version.
failed eval checks.x86_64-linux.home-manager-crs58 —
error: … while calling the 'derivationStrict' builtin at «nix-internal»/derivation-internal.nix:37:12: 36| 37| strict = …
error:
       … while calling the 'derivationStrict' builtin
         at «nix-internal»/derivation-internal.nix:37:12:
           36|
           37|   strict = derivationStrict drvAttrs;
             |            ^
           38|

       … while evaluating derivation 'home-manager-generation'
         whose name attribute is located at «https://releases.nixos.org/nixos/unstable-small/nixos-26.11pre1074459.418b43648094/nixexprs.tar.xz?narHash=sha256-Cs/wIcIPlbW1YLAZ7KoLP7KPuDqv%2Bsuw0Njzg1CAlNo%3D»/pkgs/stdenv/generic/make-derivation.nix:651:11

       … while evaluating attribute 'buildCommand' of derivation 'home-manager-generation'
         at «https://releases.nixos.org/nixos/unstable-small/nixos-26.11pre1074459.418b43648094/nixexprs.tar.xz?narHash=sha256-Cs/wIcIPlbW1YLAZ7KoLP7KPuDqv%2Bsuw0Njzg1CAlNo%3D»/pkgs/build-support/trivial-builders/default.nix:88:9:
           87|         inherit name;
           88|         buildCommand = lib.toFunction buildCommand finalAttrs;
             |         ^
           89|         passAsFile = defaultPassAsFile ++ (userAttrs.passAsFile or [ ]);

       … while evaluating the option `home.file."/home/crs58/.config/systemd/user/sops-nix.service".source':

       … while evaluating definitions from `/nix/store/5va9gi755mjcgksmybwy18k950shqsvx-source/modules/misc/xdg':

       … while evaluating the option `xdg.configFile."systemd/user/sops-nix.service".source':

       … while evaluating definitions from `/nix/store/5va9gi755mjcgksmybwy18k950shqsvx-source/modules/systemd.nix':

       … while evaluating the option `systemd.user.services.sops-nix.Service.ExecStart':

       … while evaluating definitions from `/nix/store/lvnl7lflsi8gvn2b4pdjmyiwxvp6sn6m-source/modules/home-manager/sops.nix':

       … while evaluating the option `sops.package':

       (stack trace truncated; use '--show-trace' to show the full, detailed trace)

       error: Go 1.25 is end-of-life, and 'buildGo125Module' has been removed. Please use a newer builder version.
failed eval checks.x86_64-linux.home-manager-janettesmith —
error: … while calling the 'derivationStrict' builtin at «nix-internal»/derivation-internal.nix:37:12: 36| 37| strict = …
error:
       … while calling the 'derivationStrict' builtin
         at «nix-internal»/derivation-internal.nix:37:12:
           36|
           37|   strict = derivationStrict drvAttrs;
             |            ^
           38|

       … while evaluating derivation 'home-manager-generation'
         whose name attribute is located at «https://releases.nixos.org/nixos/unstable-small/nixos-26.11pre1074459.418b43648094/nixexprs.tar.xz?narHash=sha256-Cs/wIcIPlbW1YLAZ7KoLP7KPuDqv%2Bsuw0Njzg1CAlNo%3D»/pkgs/stdenv/generic/make-derivation.nix:651:11

       … while evaluating attribute 'buildCommand' of derivation 'home-manager-generation'
         at «https://releases.nixos.org/nixos/unstable-small/nixos-26.11pre1074459.418b43648094/nixexprs.tar.xz?narHash=sha256-Cs/wIcIPlbW1YLAZ7KoLP7KPuDqv%2Bsuw0Njzg1CAlNo%3D»/pkgs/build-support/trivial-builders/default.nix:88:9:
           87|         inherit name;
           88|         buildCommand = lib.toFunction buildCommand finalAttrs;
             |         ^
           89|         passAsFile = defaultPassAsFile ++ (userAttrs.passAsFile or [ ]);

       … while evaluating the option `home.file."/home/janettesmith/.config/systemd/user/sops-nix.service".source':

       … while evaluating definitions from `/nix/store/5va9gi755mjcgksmybwy18k950shqsvx-source/modules/misc/xdg':

       … while evaluating the option `xdg.configFile."systemd/user/sops-nix.service".source':

       … while evaluating definitions from `/nix/store/5va9gi755mjcgksmybwy18k950shqsvx-source/modules/systemd.nix':

       … while evaluating the option `systemd.user.services.sops-nix.Service.ExecStart':

       … while evaluating definitions from `/nix/store/lvnl7lflsi8gvn2b4pdjmyiwxvp6sn6m-source/modules/home-manager/sops.nix':

       … while evaluating the option `sops.package':

       (stack trace truncated; use '--show-trace' to show the full, detailed trace)

       error: Go 1.25 is end-of-life, and 'buildGo125Module' has been removed. Please use a newer builder version.
failed eval checks.x86_64-linux.home-manager-raquel —
error: … while calling the 'derivationStrict' builtin at «nix-internal»/derivation-internal.nix:37:12: 36| 37| strict = …
error:
       … while calling the 'derivationStrict' builtin
         at «nix-internal»/derivation-internal.nix:37:12:
           36|
           37|   strict = derivationStrict drvAttrs;
             |            ^
           38|

       … while evaluating derivation 'home-manager-generation'
         whose name attribute is located at «https://releases.nixos.org/nixos/unstable-small/nixos-26.11pre1074459.418b43648094/nixexprs.tar.xz?narHash=sha256-Cs/wIcIPlbW1YLAZ7KoLP7KPuDqv%2Bsuw0Njzg1CAlNo%3D»/pkgs/stdenv/generic/make-derivation.nix:651:11

       … while evaluating attribute 'buildCommand' of derivation 'home-manager-generation'
         at «https://releases.nixos.org/nixos/unstable-small/nixos-26.11pre1074459.418b43648094/nixexprs.tar.xz?narHash=sha256-Cs/wIcIPlbW1YLAZ7KoLP7KPuDqv%2Bsuw0Njzg1CAlNo%3D»/pkgs/build-support/trivial-builders/default.nix:88:9:
           87|         inherit name;
           88|         buildCommand = lib.toFunction buildCommand finalAttrs;
             |         ^
           89|         passAsFile = defaultPassAsFile ++ (userAttrs.passAsFile or [ ]);

       … while evaluating the option `home.file."/home/raquel/.config/systemd/user/sops-nix.service".source':

       … while evaluating definitions from `/nix/store/5va9gi755mjcgksmybwy18k950shqsvx-source/modules/misc/xdg':

       … while evaluating the option `xdg.configFile."systemd/user/sops-nix.service".source':

       … while evaluating definitions from `/nix/store/5va9gi755mjcgksmybwy18k950shqsvx-source/modules/systemd.nix':

       … while evaluating the option `systemd.user.services.sops-nix.Service.ExecStart':

       … while evaluating definitions from `/nix/store/lvnl7lflsi8gvn2b4pdjmyiwxvp6sn6m-source/modules/home-manager/sops.nix':

       … while evaluating the option `sops.package':

       (stack trace truncated; use '--show-trace' to show the full, detailed trace)

       error: Go 1.25 is end-of-life, and 'buildGo125Module' has been removed. Please use a newer builder version.
failed eval checks.x86_64-linux.home-manager-tara —
error: … while calling the 'derivationStrict' builtin at «nix-internal»/derivation-internal.nix:37:12: 36| 37| strict = …
error:
       … while calling the 'derivationStrict' builtin
         at «nix-internal»/derivation-internal.nix:37:12:
           36|
           37|   strict = derivationStrict drvAttrs;
             |            ^
           38|

       … while evaluating derivation 'home-manager-generation'
         whose name attribute is located at «https://releases.nixos.org/nixos/unstable-small/nixos-26.11pre1074459.418b43648094/nixexprs.tar.xz?narHash=sha256-Cs/wIcIPlbW1YLAZ7KoLP7KPuDqv%2Bsuw0Njzg1CAlNo%3D»/pkgs/stdenv/generic/make-derivation.nix:651:11

       … while evaluating attribute 'buildCommand' of derivation 'home-manager-generation'
         at «https://releases.nixos.org/nixos/unstable-small/nixos-26.11pre1074459.418b43648094/nixexprs.tar.xz?narHash=sha256-Cs/wIcIPlbW1YLAZ7KoLP7KPuDqv%2Bsuw0Njzg1CAlNo%3D»/pkgs/build-support/trivial-builders/default.nix:88:9:
           87|         inherit name;
           88|         buildCommand = lib.toFunction buildCommand finalAttrs;
             |         ^
           89|         passAsFile = defaultPassAsFile ++ (userAttrs.passAsFile or [ ]);

       … while evaluating the option `home.file."/home/tara/.config/systemd/user/sops-nix.service".source':

       … while evaluating definitions from `/nix/store/5va9gi755mjcgksmybwy18k950shqsvx-source/modules/misc/xdg':

       … while evaluating the option `xdg.configFile."systemd/user/sops-nix.service".source':

       … while evaluating definitions from `/nix/store/5va9gi755mjcgksmybwy18k950shqsvx-source/modules/systemd.nix':

       … while evaluating the option `systemd.user.services.sops-nix.Service.ExecStart':

       … while evaluating definitions from `/nix/store/lvnl7lflsi8gvn2b4pdjmyiwxvp6sn6m-source/modules/home-manager/sops.nix':

       … while evaluating the option `sops.package':

       (stack trace truncated; use '--show-trace' to show the full, detailed trace)

       error: Go 1.25 is end-of-life, and 'buildGo125Module' has been removed. Please use a newer builder version.
failed eval checks.x86_64-linux.home-manager-ubuntu —
error: … while calling the 'derivationStrict' builtin at «nix-internal»/derivation-internal.nix:37:12: 36| 37| strict = …
error:
       … while calling the 'derivationStrict' builtin
         at «nix-internal»/derivation-internal.nix:37:12:
           36|
           37|   strict = derivationStrict drvAttrs;
             |            ^
           38|

       … while evaluating derivation 'home-manager-generation'
         whose name attribute is located at «https://releases.nixos.org/nixos/unstable-small/nixos-26.11pre1074459.418b43648094/nixexprs.tar.xz?narHash=sha256-Cs/wIcIPlbW1YLAZ7KoLP7KPuDqv%2Bsuw0Njzg1CAlNo%3D»/pkgs/stdenv/generic/make-derivation.nix:651:11

       … while evaluating attribute 'buildCommand' of derivation 'home-manager-generation'
         at «https://releases.nixos.org/nixos/unstable-small/nixos-26.11pre1074459.418b43648094/nixexprs.tar.xz?narHash=sha256-Cs/wIcIPlbW1YLAZ7KoLP7KPuDqv%2Bsuw0Njzg1CAlNo%3D»/pkgs/build-support/trivial-builders/default.nix:88:9:
           87|         inherit name;
           88|         buildCommand = lib.toFunction buildCommand finalAttrs;
             |         ^
           89|         passAsFile = defaultPassAsFile ++ (userAttrs.passAsFile or [ ]);

       … while evaluating the option `home.activation.sopsInstallWithoutSystemd.data':

       … while evaluating definitions from `/nix/store/p81hrdxilk6flhbnjpmh0rn39ldxw3aq-source/modules/home/base/sops-install-without-systemd.nix, via option flake.modules.homeManager.base-sops':

       … while evaluating the option `launchd.agents.sops-nix.config.Program':

       … while evaluating definitions from `/nix/store/lvnl7lflsi8gvn2b4pdjmyiwxvp6sn6m-source/modules/home-manager/sops.nix':

       … while evaluating the option `sops.package':

       (stack trace truncated; use '--show-trace' to show the full, detailed trace)

       error: Go 1.25 is end-of-life, and 'buildGo125Module' has been removed. Please use a newer builder version.
failed eval checks.x86_64-linux.nixos-cinnabar —
error: … while evaluating a branch condition at «string»:25:5: 24| v: 25| if !builtins.isAttrs v || isDrv v then …
error:
       … while evaluating a branch condition
         at «string»:25:5:
           24|     v:
           25|     if !builtins.isAttrs v || isDrv v then
             |     ^
           26|       v

       … in the left operand of the OR (||) operator
         at «string»:25:28:
           24|     v:
           25|     if !builtins.isAttrs v || isDrv v then
             |                            ^
           26|       v

       … while evaluating definitions from `/nix/store/s0fpxz3rvfip9bc50wfmwpigxiyl6nkg-source/modules/transposition.nix':

       … while evaluating definitions from `/nix/store/p81hrdxilk6flhbnjpmh0rn39ldxw3aq-source/modules/checks/machines.nix, via option perSystem':

       … while evaluating the option `system.build.toplevel':

       … while evaluating definitions from `/nix/store/acd2c1idhj02gxic6z7la1a3li9z1mf0-source/nixos/modules/system/activation/top-level.nix':

       … while evaluating the option `warnings':

       … while evaluating definitions from `/nix/store/acd2c1idhj02gxic6z7la1a3li9z1mf0-source/nixos/modules/system/boot/systemd.nix':

       … while evaluating the option `systemd.services.home-manager-cameron.serviceConfig':

       … while evaluating definitions from `/nix/store/5va9gi755mjcgksmybwy18k950shqsvx-source/nixos':

       … while evaluating the option `home-manager.users.cameron.home.file."/home/cameron/.config/systemd/user/sops-nix.service".source':

       … while evaluating definitions from `/nix/store/5va9gi755mjcgksmybwy18k950shqsvx-source/modules/misc/xdg':

       … while evaluating the option `home-manager.users.cameron.xdg.configFile."systemd/user/sops-nix.service".source':

       … while evaluating definitions from `/nix/store/5va9gi755mjcgksmybwy18k950shqsvx-source/modules/systemd.nix':

       … while evaluating the option `home-manager.users.cameron.systemd.user.services.sops-nix.Service.ExecStart':

       … while evaluating definitions from `/nix/store/lvnl7lflsi8gvn2b4pdjmyiwxvp6sn6m-source/modules/home-manager/sops.nix':

       … while evaluating the option `home-manager.users.cameron.sops.package':

       (stack trace truncated; use '--show-trace' to show the full, detailed trace)

       error: Go 1.25 is end-of-life, and 'buildGo125Module' has been removed. Please use a newer builder version.
failed eval checks.x86_64-linux.nixos-electrum —
error: … while evaluating a branch condition at «string»:25:5: 24| v: 25| if !builtins.isAttrs v || isDrv v then …
error:
       … while evaluating a branch condition
         at «string»:25:5:
           24|     v:
           25|     if !builtins.isAttrs v || isDrv v then
             |     ^
           26|       v

       … in the left operand of the OR (||) operator
         at «string»:25:28:
           24|     v:
           25|     if !builtins.isAttrs v || isDrv v then
             |                            ^
           26|       v

       … while evaluating definitions from `/nix/store/s0fpxz3rvfip9bc50wfmwpigxiyl6nkg-source/modules/transposition.nix':

       … while evaluating definitions from `/nix/store/p81hrdxilk6flhbnjpmh0rn39ldxw3aq-source/modules/checks/machines.nix, via option perSystem':

       … while evaluating the option `system.build.toplevel':

       … while evaluating definitions from `/nix/store/acd2c1idhj02gxic6z7la1a3li9z1mf0-source/nixos/modules/system/activation/top-level.nix':

       … while evaluating the option `warnings':

       … while evaluating definitions from `/nix/store/acd2c1idhj02gxic6z7la1a3li9z1mf0-source/nixos/modules/system/boot/systemd.nix':

       … while evaluating the option `systemd.services.home-manager-cameron.serviceConfig':

       … while evaluating definitions from `/nix/store/5va9gi755mjcgksmybwy18k950shqsvx-source/nixos':

       … while evaluating the option `home-manager.users.cameron.home.file."/home/cameron/.config/systemd/user/sops-nix.service".source':

       … while evaluating definitions from `/nix/store/5va9gi755mjcgksmybwy18k950shqsvx-source/modules/misc/xdg':

       … while evaluating the option `home-manager.users.cameron.xdg.configFile."systemd/user/sops-nix.service".source':

       … while evaluating definitions from `/nix/store/5va9gi755mjcgksmybwy18k950shqsvx-source/modules/systemd.nix':

       … while evaluating the option `home-manager.users.cameron.systemd.user.services.sops-nix.Service.ExecStart':

       … while evaluating definitions from `/nix/store/lvnl7lflsi8gvn2b4pdjmyiwxvp6sn6m-source/modules/home-manager/sops.nix':

       … while evaluating the option `home-manager.users.cameron.sops.package':

       (stack trace truncated; use '--show-trace' to show the full, detailed trace)

       error: Go 1.25 is end-of-life, and 'buildGo125Module' has been removed. Please use a newer builder version.
failed eval checks.x86_64-linux.nixos-galena —
error: … while evaluating a branch condition at «string»:25:5: 24| v: 25| if !builtins.isAttrs v || isDrv v then …
error:
       … while evaluating a branch condition
         at «string»:25:5:
           24|     v:
           25|     if !builtins.isAttrs v || isDrv v then
             |     ^
           26|       v

       … in the left operand of the OR (||) operator
         at «string»:25:28:
           24|     v:
           25|     if !builtins.isAttrs v || isDrv v then
             |                            ^
           26|       v

       … while evaluating definitions from `/nix/store/s0fpxz3rvfip9bc50wfmwpigxiyl6nkg-source/modules/transposition.nix':

       … while evaluating definitions from `/nix/store/p81hrdxilk6flhbnjpmh0rn39ldxw3aq-source/modules/checks/machines.nix, via option perSystem':

       … while evaluating the option `system.build.toplevel':

       … while evaluating definitions from `/nix/store/acd2c1idhj02gxic6z7la1a3li9z1mf0-source/nixos/modules/system/activation/top-level.nix':

       … while evaluating the option `warnings':

       … while evaluating definitions from `/nix/store/acd2c1idhj02gxic6z7la1a3li9z1mf0-source/nixos/modules/system/boot/systemd.nix':

       … while evaluating the option `systemd.services.home-manager-cameron.serviceConfig':

       … while evaluating definitions from `/nix/store/5va9gi755mjcgksmybwy18k950shqsvx-source/nixos':

       … while evaluating the option `home-manager.users.cameron.home.file."/home/cameron/.config/systemd/user/sops-nix.service".source':

       … while evaluating definitions from `/nix/store/5va9gi755mjcgksmybwy18k950shqsvx-source/modules/misc/xdg':

       … while evaluating the option `home-manager.users.cameron.xdg.configFile."systemd/user/sops-nix.service".source':

       … while evaluating definitions from `/nix/store/5va9gi755mjcgksmybwy18k950shqsvx-source/modules/systemd.nix':

       … while evaluating the option `home-manager.users.cameron.systemd.user.services.sops-nix.Service.ExecStart':

       … while evaluating definitions from `/nix/store/lvnl7lflsi8gvn2b4pdjmyiwxvp6sn6m-source/modules/home-manager/sops.nix':

       … while evaluating the option `home-manager.users.cameron.sops.package':

       (stack trace truncated; use '--show-trace' to show the full, detailed trace)

       error: Go 1.25 is end-of-life, and 'buildGo125Module' has been removed. Please use a newer builder version.
failed eval checks.x86_64-linux.nixos-magnetite —
error: … while evaluating a branch condition at «string»:25:5: 24| v: 25| if !builtins.isAttrs v || isDrv v then …
error:
       … while evaluating a branch condition
         at «string»:25:5:
           24|     v:
           25|     if !builtins.isAttrs v || isDrv v then
             |     ^
           26|       v

       … in the left operand of the OR (||) operator
         at «string»:25:28:
           24|     v:
           25|     if !builtins.isAttrs v || isDrv v then
             |                            ^
           26|       v

       … while evaluating definitions from `/nix/store/s0fpxz3rvfip9bc50wfmwpigxiyl6nkg-source/modules/transposition.nix':

       … while evaluating definitions from `/nix/store/p81hrdxilk6flhbnjpmh0rn39ldxw3aq-source/modules/checks/machines.nix, via option perSystem':

       … while evaluating the option `system.build.toplevel':

       … while evaluating definitions from `/nix/store/acd2c1idhj02gxic6z7la1a3li9z1mf0-source/nixos/modules/system/activation/top-level.nix':

       … while evaluating the option `warnings':

       … while evaluating definitions from `/nix/store/acd2c1idhj02gxic6z7la1a3li9z1mf0-source/nixos/modules/system/boot/systemd.nix':

       … while evaluating the option `systemd.services.home-manager-cameron.serviceConfig':

       … while evaluating definitions from `/nix/store/5va9gi755mjcgksmybwy18k950shqsvx-source/nixos':

       … while evaluating the option `home-manager.users.cameron.home.file."/home/cameron/.config/systemd/user/sops-nix.service".source':

       … while evaluating definitions from `/nix/store/5va9gi755mjcgksmybwy18k950shqsvx-source/modules/misc/xdg':

       … while evaluating the option `home-manager.users.cameron.xdg.configFile."systemd/user/sops-nix.service".source':

       … while evaluating definitions from `/nix/store/5va9gi755mjcgksmybwy18k950shqsvx-source/modules/systemd.nix':

       … while evaluating the option `home-manager.users.cameron.systemd.user.services.sops-nix.Service.ExecStart':

       … while evaluating definitions from `/nix/store/lvnl7lflsi8gvn2b4pdjmyiwxvp6sn6m-source/modules/home-manager/sops.nix':

       … while evaluating the option `home-manager.users.cameron.sops.package':

       (stack trace truncated; use '--show-trace' to show the full, detailed trace)

       error: Go 1.25 is end-of-life, and 'buildGo125Module' has been removed. Please use a newer builder version.
failed eval checks.x86_64-linux.nixos-pyrite —
error: … while evaluating a branch condition at «string»:25:5: 24| v: 25| if !builtins.isAttrs v || isDrv v then …
error:
       … while evaluating a branch condition
         at «string»:25:5:
           24|     v:
           25|     if !builtins.isAttrs v || isDrv v then
             |     ^
           26|       v

       … in the left operand of the OR (||) operator
         at «string»:25:28:
           24|     v:
           25|     if !builtins.isAttrs v || isDrv v then
             |                            ^
           26|       v

       … while evaluating definitions from `/nix/store/s0fpxz3rvfip9bc50wfmwpigxiyl6nkg-source/modules/transposition.nix':

       … while evaluating definitions from `/nix/store/p81hrdxilk6flhbnjpmh0rn39ldxw3aq-source/modules/checks/machines.nix, via option perSystem':

       … while evaluating the option `system.build.toplevel':

       … while evaluating definitions from `/nix/store/acd2c1idhj02gxic6z7la1a3li9z1mf0-source/nixos/modules/system/activation/top-level.nix':

       … while evaluating the option `warnings':

       … while evaluating definitions from `/nix/store/acd2c1idhj02gxic6z7la1a3li9z1mf0-source/nixos/modules/system/boot/systemd.nix':

       … while evaluating the option `systemd.services.home-manager-cameron.serviceConfig':

       … while evaluating definitions from `/nix/store/5va9gi755mjcgksmybwy18k950shqsvx-source/nixos':

       … while evaluating the option `home-manager.users.cameron.home.file."/home/cameron/.config/systemd/user/sops-nix.service".source':

       … while evaluating definitions from `/nix/store/5va9gi755mjcgksmybwy18k950shqsvx-source/modules/misc/xdg':

       … while evaluating the option `home-manager.users.cameron.xdg.configFile."systemd/user/sops-nix.service".source':

       … while evaluating definitions from `/nix/store/5va9gi755mjcgksmybwy18k950shqsvx-source/modules/systemd.nix':

       … while evaluating the option `home-manager.users.cameron.systemd.user.services.sops-nix.Service.ExecStart':

       … while evaluating definitions from `/nix/store/lvnl7lflsi8gvn2b4pdjmyiwxvp6sn6m-source/modules/home-manager/sops.nix':

       … while evaluating the option `home-manager.users.cameron.sops.package':

       (stack trace truncated; use '--show-trace' to show the full, detailed trace)

       error: Go 1.25 is end-of-life, and 'buildGo125Module' has been removed. Please use a newer builder version.
failed checks.x86_64-linux.pi-agent-environment-policy 0s
pi-agent-environment-policy: typecheck/tsconfig.json:1:55 - error TS5102: Option 'baseUrl' has been removed. Please remove it from your configuration. Use '"p …
pi-agent-environment-policy:
typecheck/tsconfig.json:1:55 - error TS5102: Option 'baseUrl' has been removed. Please remove it from your configuration.
  Use '"paths": {"*": ["./*"]}' instead.
1 {"compilerOptions":{"allowImportingTsExtensions":true,"baseUrl":".","module":"ESNext","moduleResolution":"Bundler","noEmit":true,"paths":{"pi-agent-extensions/permission-gate/*":["./permission-gate/*"]},"skipLibCheck":true,"strict":true,"target":"ES2022"},"files":["./external.d.ts","./permission-rules.ts","./edit-write-policy.ts","./policy-test.ts"]}
                                                        ~~~~~~~~~
Found 1 error in typecheck/tsconfig.json:1
failed checks.x86_64-linux.stibnite-access-wiring 3m 40s
setup: error: Cannot build '/nix/store/jh1q5brh6a1axwnq8nj7b0awva4cjbhb-nix-flake-tests-2.34.8.drv'. Reason: 3 dependencies failed. Output paths: …
setup:
error: Cannot build '/nix/store/jh1q5brh6a1axwnq8nj7b0awva4cjbhb-nix-flake-tests-2.34.8.drv'.
       Reason: 3 dependencies failed.
       Output paths:
         /nix/store/4rml5vcv29a2gbvh13p09s06bfzkrr6x-nix-flake-tests-2.34.8
error: Cannot build '/nix/store/wgr7yxwsnzp8gkn11g02w49agi8253hc-nix-store-tests-run.drv'.
       Reason: 2 dependencies failed.
       Output paths:
         /nix/store/69xsnxyw2xm8ibsx082afc9ygs21fqy7-nix-store-tests-run
error: Cannot build '/nix/store/cf5gwlhdy6kw4n0gw0a7yr5jfi1pyi91-nix-expr-tests-run.drv'.
       Reason: 2 dependencies failed.
       Output paths:
         /nix/store/hqcb9sfb7r4fkpkg03hrgjn0yv35w7yy-nix-expr-tests-run
error: Cannot build '/nix/store/l72lsg6hgkm437glq6dds0k011a7si87-nix-flake-tests-run.drv'.
       Reason: 2 dependencies failed.
       Output paths:
         /nix/store/c03mfix4f9kn0i39n578x6rp7pld66xg-nix-flake-tests-run
error: Cannot build '/nix/store/rm54hlg5pyckqs86pxnqmajf5ggcm4g5-nix-functional-tests-2.34.8.drv'.
       Reason: 1 dependency failed.
       Output paths:
         /nix/store/fkrgkkjqqgdawd78p1i6vxjz59m71yai-nix-functional-tests-2.34.8
error: Cannot build '/nix/store/zb2h4wvmfcxapca01cyic6c01afcjdh7-nix-manual-2.34.8.drv'.
       Reason: 1 dependency failed.
       Output paths:
         /nix/store/i45cg4qwyyrs47yszb8ylg6psn10y8ga-nix-manual-2.34.8
         /nix/store/nqyayzjng7w18v449w7r489x2i9h31vq-nix-manual-2.34.8-man
error: Cannot build '/nix/store/rpiw3vk3wmr7flfw03krg6bnbv2mll8d-nix-2.34.8.drv'.
       Reason: 16 dependencies failed.
       Output paths:
         /nix/store/7lq6zyrrbs1z97j4clk9zzx6hhyiqnqm-nix-2.34.8
         /nix/store/b07ixfrfgxjzc1ghrbhkm8klxd9ni2fm-nix-2.34.8-dev
         /nix/store/nwwng98wdjdwqr51638dxbnxjxy94css-nix-2.34.8-man
         /nix/store/z603cb6d3hlw1jiyqylwm2iqsvq7rjka-nix-2.34.8-doc
error: Cannot build '/nix/store/7xccdzi3vw1yky03a613glrm7ivb05m2-structure-stibnite-access-wiring.drv'.
       Reason: 1 dependency failed.
       Output paths:
         /nix/store/q57cdhspill0hvz4n2cdw1jb1q31z658-structure-stibnite-access-wiring
failed checks.x86_64-linux.terraform-validate 0s
terraform-validate: - Installed hetznercloud/hcloud v1.68.0 (unauthenticated) - Installed hashicorp/tls v4.4.0 (unauthenticated) - Installed hashicorp/null v3.3 …
terraform-validate:
- Installed hetznercloud/hcloud v1.68.0 (unauthenticated)
- Installed hashicorp/tls v4.4.0 (unauthenticated)
- Installed hashicorp/null v3.3.1 (unauthenticated)
╷
│ Error: Failed to resolve provider packages
│ 
│ Could not resolve provider hashicorp/google: no available releases match the given constraints ~> 7.0
╵
96 succeeded
succeeded attributes
status attribute duration
loading…
17 already built
skipped attributes
status attribute duration
loading…