nixbot

builds

cameronraysmith/vanixiets build #483 failed

branch main · PR #2913 · commit a2b89a0f8d · · took 2m 54s

eval warnings 2 kinds · 24 occurrences
  • warn stdenv.isLinux is deprecated, use stdenv.hostPlatform.isLinux instead ×12
  • warn stdenv.isDarwin is deprecated, use stdenv.hostPlatform.isDarwin instead ×12

4 failed
failed attributes
status attribute duration
failed checks.x86_64-linux.apps-build 38s
vanixiets-docs-0.0.0-development: 22:41:33 [ERROR] [vite] ✗ Build failed in 1.08s `@astrojs/markdown-remark` is too old to render `.mdx` files. Update it to the …
vanixiets-docs-0.0.0-development:
22:41:33 [ERROR] [vite] ✗ Build failed in 1.08s
`@astrojs/markdown-remark` is too old to render `.mdx` files. Update it to the latest version — a `^` range on an older version will not pick it up:
  npm install @astrojs/markdown-remark@latest
  Location:
    /build/source/packages/docs/src/content/docs/index.mdx:0:0
  Stack trace:
    at TransformPluginContextImpl.handler (file:///build/source/node_modules/.bun/@astrojs+mdx@8.0.1+72d5cb1648d36ca2/node_modules/@astrojs/mdx/dist/vite-plugin-mdx.js:64:17)
    at async plugin.<computed> (file:///build/source/node_modules/.bun/rolldown@1.1.3/node_modules/rolldown/dist/shared/bindingify-input-options-CzVhGygm.mjs:1961:12)
failed checks.x86_64-linux.package-vanixiets-docs 53s
vanixiets-docs-0.0.0-development: 22:42:03 [ERROR] [vite] ✗ Build failed in 1.16s `@astrojs/markdown-remark` is too old to render `.mdx` files. Update it to the …
vanixiets-docs-0.0.0-development:
22:42:03 [ERROR] [vite] ✗ Build failed in 1.16s
`@astrojs/markdown-remark` is too old to render `.mdx` files. Update it to the latest version — a `^` range on an older version will not pick it up:
  npm install @astrojs/markdown-remark@latest
  Location:
    /build/source/packages/docs/src/content/docs/index.mdx:0:0
  Stack trace:
    at TransformPluginContextImpl.handler (file:///build/source/node_modules/.bun/@astrojs+mdx@8.0.1+72d5cb1648d36ca2/node_modules/@astrojs/mdx/dist/vite-plugin-mdx.js:64:17)
    at async plugin.<computed> (file:///build/source/node_modules/.bun/rolldown@1.1.3/node_modules/rolldown/dist/shared/bindingify-input-options-CzVhGygm.mjs:1961:12)
dependency failed checks.x86_64-linux.package-vanixiets-docs-test-e2e —
failed checks.x86_64-linux.package-vanixiets-docs-test-linkcheck 26s
vanixiets-docs-linkcheck-0.0.0-development: 22:41:44 [ERROR] [vite] ✗ Build failed in 1.05s `@astrojs/markdown-remark` is too old to render `.mdx` files. Update …
vanixiets-docs-linkcheck-0.0.0-development:
22:41:44 [ERROR] [vite] ✗ Build failed in 1.05s
`@astrojs/markdown-remark` is too old to render `.mdx` files. Update it to the latest version — a `^` range on an older version will not pick it up:
  npm install @astrojs/markdown-remark@latest
  Location:
    /build/source/packages/docs/src/content/docs/index.mdx:0:0
  Stack trace:
    at TransformPluginContextImpl.handler (file:///build/source/node_modules/.bun/@astrojs+mdx@8.0.1+72d5cb1648d36ca2/node_modules/@astrojs/mdx/dist/vite-plugin-mdx.js:64:17)
    at async plugin.<computed> (file:///build/source/node_modules/.bun/rolldown@1.1.3/node_modules/rolldown/dist/shared/bindingify-input-options-CzVhGygm.mjs:1961:12)
21 succeeded
succeeded attributes
status attribute duration
loading…
103 already built
skipped attributes
status attribute duration
loading…