nixbot

builds

cameronraysmith/vanixiets build #634 failed

branch main · PR #2913 · commit 7f3ae9ab89 · · took 8m 4s

eval warnings 2 kinds · 28 occurrences
  • warn stdenv.isLinux is deprecated, use stdenv.hostPlatform.isLinux instead ×15
  • warn stdenv.isDarwin is deprecated, use stdenv.hostPlatform.isDarwin instead ×13

4 failed
failed attributes
status attribute duration
failed checks.x86_64-linux.apps-build 1m 37s
vanixiets-docs-0.0.0-development: 04:28:17 [ERROR] [vite] ✗ Build failed in 1.22s `@astrojs/markdown-remark` is too old to render `.mdx` files. Update it to the …
vanixiets-docs-0.0.0-development:
04:28:17 [ERROR] [vite] ✗ Build failed in 1.22s
`@astrojs/markdown-remark` is too old to render `.mdx` files. Update it to the latest version — a `^` range on an older version will not pick it up:
  npm install @astrojs/markdown-remark@latest
  Location:
    /build/source/packages/docs/src/content/docs/index.mdx:0:0
  Stack trace:
    at TransformPluginContextImpl.handler (file:///build/source/node_modules/.bun/@astrojs+mdx@8.0.1+acc39339c2c30831/node_modules/@astrojs/mdx/dist/vite-plugin-mdx.js:64:17)
    at async plugin.<computed> (file:///build/source/node_modules/.bun/rolldown@1.1.3/node_modules/rolldown/dist/shared/bindingify-input-options-CzVhGygm.mjs:1961:12)
failed checks.x86_64-linux.package-vanixiets-docs 27s
vanixiets-docs-0.0.0-development: 04:28:45 [ERROR] [vite] ✗ Build failed in 1.49s `@astrojs/markdown-remark` is too old to render `.mdx` files. Update it to the …
vanixiets-docs-0.0.0-development:
04:28:45 [ERROR] [vite] ✗ Build failed in 1.49s
`@astrojs/markdown-remark` is too old to render `.mdx` files. Update it to the latest version — a `^` range on an older version will not pick it up:
  npm install @astrojs/markdown-remark@latest
  Location:
    /build/source/packages/docs/src/content/docs/index.mdx:0:0
  Stack trace:
    at TransformPluginContextImpl.handler (file:///build/source/node_modules/.bun/@astrojs+mdx@8.0.1+acc39339c2c30831/node_modules/@astrojs/mdx/dist/vite-plugin-mdx.js:64:17)
    at async plugin.<computed> (file:///build/source/node_modules/.bun/rolldown@1.1.3/node_modules/rolldown/dist/shared/bindingify-input-options-CzVhGygm.mjs:1961:12)
dependency failed checks.x86_64-linux.package-vanixiets-docs-test-e2e —
failed checks.x86_64-linux.package-vanixiets-docs-test-linkcheck 26s
vanixiets-docs-linkcheck-0.0.0-development: 04:28:45 [ERROR] [vite] ✗ Build failed in 961ms `@astrojs/markdown-remark` is too old to render `.mdx` files. Update …
vanixiets-docs-linkcheck-0.0.0-development:
04:28:45 [ERROR] [vite] ✗ Build failed in 961ms
`@astrojs/markdown-remark` is too old to render `.mdx` files. Update it to the latest version — a `^` range on an older version will not pick it up:
  npm install @astrojs/markdown-remark@latest
  Location:
    /build/source/packages/docs/src/content/docs/index.mdx:0:0
  Stack trace:
    at TransformPluginContextImpl.handler (file:///build/source/node_modules/.bun/@astrojs+mdx@8.0.1+acc39339c2c30831/node_modules/@astrojs/mdx/dist/vite-plugin-mdx.js:64:17)
    at async plugin.<computed> (file:///build/source/node_modules/.bun/rolldown@1.1.3/node_modules/rolldown/dist/shared/bindingify-input-options-CzVhGygm.mjs:1961:12)
23 succeeded
succeeded attributes
status attribute duration
loading…
115 already built
skipped attributes
status attribute duration
loading…