failed attributes
| status |
attribute |
duration |
| failed |
checks.x86_64-linux.home-manager-cameron
- stdenv.isLinux is deprecated, use stdenv.hostPlatform.isLinux instead
- stdenv.isDarwin is deprecated, use stdenv.hostPlatform.isDarwin instead
|
56m 35s |
clipboard-jh-0.10.0:
[ 69%] Building CXX object src/cb/CMakeFiles/cb.dir/src/utils/distance.cpp.o
[ 70%] Building CXX object src/cb/CMakeFiles/cb.dir/src/utils/ …
clipboard-jh-0.10.0:
[ 69%] Building CXX object src/cb/CMakeFiles/cb.dir/src/utils/distance.cpp.o
[ 70%] Building CXX object src/cb/CMakeFiles/cb.dir/src/utils/directorysize.cpp.o
[ 72%] Building CXX object src/cb/CMakeFiles/cb.dir/src/utils/cowcopy.cpp.o
[ 73%] Building CXX object src/cb/CMakeFiles/cb.dir/src/platforms/x11wl.cpp.o
[ 74%] Building CXX object src/cb/CMakeFiles/cb.dir/src/platforms/linux.cpp.o
[ 76%] Linking CXX executable ../../cb
[ 76%] Built target cb
make: *** [Makefile:136: all] Error 2
python3.14-ladybug-0.16.0:
27 | uint32_t TProtocol::skip_virt(TType type) {
| ^~~~~~~~
/build/source/third_party/thrift/protocol/TProtocol.cpp:21:1: note: ‘uint32_t’ is defined in header ‘<cstdint>’; this is probably fixable by adding ‘#include <cstdint>’
20 | #include "protocol/TProtocol.h"
+++ |+#include <cstdint>
21 |
[242/1057] Building CXX object third_party/antlr4_cypher/CMakeFiles/antlr4_cypher.dir/cypher_parser.cpp.o
ninja: build stopped: subcommand failed.
|
| failed |
checks.x86_64-linux.home-manager-christophersmith
- stdenv.isLinux is deprecated, use stdenv.hostPlatform.isLinux instead
- stdenv.isDarwin is deprecated, use stdenv.hostPlatform.isDarwin instead
|
27m 37s |
clipboard-jh-0.10.0:
[ 69%] Building CXX object src/cb/CMakeFiles/cb.dir/src/utils/distance.cpp.o
[ 70%] Building CXX object src/cb/CMakeFiles/cb.dir/src/utils/ …
clipboard-jh-0.10.0:
[ 69%] Building CXX object src/cb/CMakeFiles/cb.dir/src/utils/distance.cpp.o
[ 70%] Building CXX object src/cb/CMakeFiles/cb.dir/src/utils/directorysize.cpp.o
[ 72%] Building CXX object src/cb/CMakeFiles/cb.dir/src/utils/cowcopy.cpp.o
[ 73%] Building CXX object src/cb/CMakeFiles/cb.dir/src/platforms/x11wl.cpp.o
[ 74%] Building CXX object src/cb/CMakeFiles/cb.dir/src/platforms/linux.cpp.o
[ 76%] Linking CXX executable ../../cb
[ 76%] Built target cb
make: *** [Makefile:136: all] Error 2
|
| failed |
checks.x86_64-linux.home-manager-crs58
- stdenv.isLinux is deprecated, use stdenv.hostPlatform.isLinux instead
- stdenv.isDarwin is deprecated, use stdenv.hostPlatform.isDarwin instead
|
56m 40s |
python3.14-ladybug-0.16.0:
| ^~~~~~~~
/build/source/third_party/thrift/transport/TBufferTransports.cpp:120:32: note: ‘uint3 …
python3.14-ladybug-0.16.0:
| ^~~~~~~~
/build/source/third_party/thrift/transport/TBufferTransports.cpp:120:32: note: ‘uint32_t’ is defined in header ‘<cstdint>’; this is probably fixable by adding ‘#include <cstdint>’
/build/source/third_party/thrift/transport/TBufferTransports.cpp:128:7: error: ‘uint8_t’ does not name a type
128 | const uint8_t* TMemoryBuffer::borrowSlow(uint8_t* buf, uint32_t* len) {
| ^~~~~~~
/build/source/third_party/thrift/transport/TBufferTransports.cpp:128:7: note: ‘uint8_t’ is defined in header ‘<cstdint>’; this is probably fixable by adding ‘#include <cstdint>’
[212/1057] Building CXX object third_party/antlr4_cypher/CMakeFiles/antlr4_cypher.dir/cypher_parser.cpp.o
ninja: build stopped: subcommand failed.
clipboard-jh-0.10.0:
[ 70%] Building CXX object src/cb/CMakeFiles/cb.dir/src/utils/distance.cpp.o
[ 72%] Building CXX object src/cb/CMakeFiles/cb.dir/src/utils/directorysize.cpp.o
[ 73%] Building CXX object src/cb/CMakeFiles/cb.dir/src/utils/cowcopy.cpp.o
[ 74%] Building CXX object src/cb/CMakeFiles/cb.dir/src/platforms/x11wl.cpp.o
[ 76%] Building CXX object src/cb/CMakeFiles/cb.dir/src/platforms/linux.cpp.o
[ 77%] Linking CXX executable ../../cb
[ 77%] Built target cb
make: *** [Makefile:136: all] Error 2
|
| failed |
checks.x86_64-linux.home-manager-janettesmith
- stdenv.isLinux is deprecated, use stdenv.hostPlatform.isLinux instead
- stdenv.isDarwin is deprecated, use stdenv.hostPlatform.isDarwin instead
|
27m 35s |
clipboard-jh-0.10.0:
[ 82%] Building CXX object src/cb/CMakeFiles/cb.dir/src/utils/distance.cpp.o
[ 84%] Building CXX object src/cb/CMakeFiles/cb.dir/src/utils/ …
clipboard-jh-0.10.0:
[ 82%] Building CXX object src/cb/CMakeFiles/cb.dir/src/utils/distance.cpp.o
[ 84%] Building CXX object src/cb/CMakeFiles/cb.dir/src/utils/directorysize.cpp.o
[ 85%] Building CXX object src/cb/CMakeFiles/cb.dir/src/utils/cowcopy.cpp.o
[ 86%] Building CXX object src/cb/CMakeFiles/cb.dir/src/platforms/x11wl.cpp.o
[ 88%] Building CXX object src/cb/CMakeFiles/cb.dir/src/platforms/linux.cpp.o
[ 89%] Linking CXX executable ../../cb
[ 89%] Built target cb
make: *** [Makefile:136: all] Error 2
|
| failed |
checks.x86_64-linux.home-manager-raquel
- stdenv.isLinux is deprecated, use stdenv.hostPlatform.isLinux instead
- stdenv.isDarwin is deprecated, use stdenv.hostPlatform.isDarwin instead
|
27m 39s |
clipboard-jh-0.10.0:
[ 69%] Building CXX object src/cb/CMakeFiles/cb.dir/src/utils/distance.cpp.o
[ 70%] Building CXX object src/cb/CMakeFiles/cb.dir/src/utils/ …
clipboard-jh-0.10.0:
[ 69%] Building CXX object src/cb/CMakeFiles/cb.dir/src/utils/distance.cpp.o
[ 70%] Building CXX object src/cb/CMakeFiles/cb.dir/src/utils/directorysize.cpp.o
[ 72%] Building CXX object src/cb/CMakeFiles/cb.dir/src/utils/cowcopy.cpp.o
[ 73%] Building CXX object src/cb/CMakeFiles/cb.dir/src/platforms/x11wl.cpp.o
[ 74%] Building CXX object src/cb/CMakeFiles/cb.dir/src/platforms/linux.cpp.o
[ 76%] Linking CXX executable ../../cb
[ 76%] Built target cb
make: *** [Makefile:136: all] Error 2
|
| failed |
checks.x86_64-linux.home-manager-tara
- stdenv.isLinux is deprecated, use stdenv.hostPlatform.isLinux instead
- stdenv.isDarwin is deprecated, use stdenv.hostPlatform.isDarwin instead
|
27m 39s |
clipboard-jh-0.10.0:
[ 73%] Building CXX object src/cb/CMakeFiles/cb.dir/src/utils/directorysize.cpp.o
[ 74%] Building CXX object src/cb/CMakeFiles/cb.dir/src/u …
clipboard-jh-0.10.0:
[ 73%] Building CXX object src/cb/CMakeFiles/cb.dir/src/utils/directorysize.cpp.o
[ 74%] Building CXX object src/cb/CMakeFiles/cb.dir/src/utils/distance.cpp.o
[ 76%] Building CXX object src/cb/CMakeFiles/cb.dir/src/utils/cowcopy.cpp.o
[ 77%] Building CXX object src/cb/CMakeFiles/cb.dir/src/platforms/x11wl.cpp.o
[ 78%] Building CXX object src/cb/CMakeFiles/cb.dir/src/platforms/linux.cpp.o
[ 80%] Linking CXX executable ../../cb
[ 80%] Built target cb
make: *** [Makefile:136: all] Error 2
|
| failed |
checks.x86_64-linux.nixos-cinnabar
- stdenv.isDarwin is deprecated, use stdenv.hostPlatform.isDarwin instead
- stdenv.isLinux is deprecated, use stdenv.hostPlatform.isLinux instead
- stdenv.isLinux is deprecated, use stdenv.hostPlatform.isLinux instead
- stdenv.isDarwin is deprecated, use stdenv.hostPlatform.isDarwin instead
|
55m 52s |
clipboard-jh-0.10.0:
[ 69%] Building CXX object src/cb/CMakeFiles/cb.dir/src/utils/distance.cpp.o
[ 70%] Building CXX object src/cb/CMakeFiles/cb.dir/src/utils/ …
clipboard-jh-0.10.0:
[ 69%] Building CXX object src/cb/CMakeFiles/cb.dir/src/utils/distance.cpp.o
[ 70%] Building CXX object src/cb/CMakeFiles/cb.dir/src/utils/directorysize.cpp.o
[ 72%] Building CXX object src/cb/CMakeFiles/cb.dir/src/utils/cowcopy.cpp.o
[ 73%] Building CXX object src/cb/CMakeFiles/cb.dir/src/platforms/x11wl.cpp.o
[ 74%] Building CXX object src/cb/CMakeFiles/cb.dir/src/platforms/linux.cpp.o
[ 76%] Linking CXX executable ../../cb
[ 76%] Built target cb
make: *** [Makefile:136: all] Error 2
python3.14-ladybug-0.16.0:
/build/source/third_party/thrift/protocol/TProtocol.cpp:21:1: note: ‘uint32_t’ is defined in header ‘<cstdint>’; this is probably fixable by adding ‘#include <cstdint>’
20 | #include "protocol/TProtocol.h"
+++ |+#include <cstdint>
21 |
[202/1057] Generating /build/source/third_party/antlr4_cypher/cypher_lexer.cpp, /build/source/third_party/antlr4_cypher/cypher_parser.cpp, /build/source/third_party/antlr4_cypher/include/cypher_lexer.h, /build/source/third_party/antlr4_cypher/include/cypher_parser.h
-- Found Python3: /nix/store/lb41b0anx1f98y9y5s9mdv97gjgsq740-python3-3.14.7/bin/python3.14 (found version "3.14.7") found components: Interpreter
[215/1057] Building C object third_party/yyjson/CMakeFiles/yyjson.dir/src/yyjson.c.o
ninja: build stopped: subcommand failed.
|
| failed |
checks.x86_64-linux.nixos-magnetite
- stdenv.isLinux is deprecated, use stdenv.hostPlatform.isLinux instead
|
43m 34s |
python3.14-ladybug-0.16.0:
27 | uint32_t TProtocol::skip_virt(TType type) {
| ^~~~~~~~
/build/source/third_party/thrift/protocol/TProtocol.cpp:21:1: no …
python3.14-ladybug-0.16.0:
27 | uint32_t TProtocol::skip_virt(TType type) {
| ^~~~~~~~
/build/source/third_party/thrift/protocol/TProtocol.cpp:21:1: note: ‘uint32_t’ is defined in header ‘<cstdint>’; this is probably fixable by adding ‘#include <cstdint>’
20 | #include "protocol/TProtocol.h"
+++ |+#include <cstdint>
21 |
[216/1057] Building CXX object third_party/antlr4_cypher/CMakeFiles/antlr4_cypher.dir/cypher_parser.cpp.o
ninja: build stopped: subcommand failed.
clipboard-jh-0.10.0:
[ 76%] Building CXX object src/cb/CMakeFiles/cb.dir/src/utils/distance.cpp.o
[ 77%] Building CXX object src/cb/CMakeFiles/cb.dir/src/utils/directorysize.cpp.o
[ 78%] Building CXX object src/cb/CMakeFiles/cb.dir/src/utils/cowcopy.cpp.o
[ 80%] Building CXX object src/cb/CMakeFiles/cb.dir/src/platforms/x11wl.cpp.o
[ 81%] Building CXX object src/cb/CMakeFiles/cb.dir/src/platforms/linux.cpp.o
[ 82%] Linking CXX executable ../../cb
[ 82%] Built target cb
make: *** [Makefile:136: all] Error 2
|
| failed |
checks.x86_64-linux.home-manager-ubuntu
|
2m 53s |
clipboard-jh-0.10.0:
[ 74%] Building CXX object src/cb/CMakeFiles/cb.dir/src/utils/distance.cpp.o
[ 76%] Building CXX object src/cb/CMakeFiles/cb.dir/src/utils/ …
clipboard-jh-0.10.0:
[ 74%] Building CXX object src/cb/CMakeFiles/cb.dir/src/utils/distance.cpp.o
[ 76%] Building CXX object src/cb/CMakeFiles/cb.dir/src/utils/directorysize.cpp.o
[ 77%] Building CXX object src/cb/CMakeFiles/cb.dir/src/utils/cowcopy.cpp.o
[ 78%] Building CXX object src/cb/CMakeFiles/cb.dir/src/platforms/x11wl.cpp.o
[ 80%] Building CXX object src/cb/CMakeFiles/cb.dir/src/platforms/linux.cpp.o
[ 81%] Linking CXX executable ../../cb
[ 81%] Built target cb
make: *** [Makefile:136: all] Error 2
|
| failed |
checks.x86_64-linux.nixos-electrum
|
44m 24s |
clipboard-jh-0.10.0:
[ 69%] Building CXX object src/cb/CMakeFiles/cb.dir/src/utils/distance.cpp.o
[ 70%] Building CXX object src/cb/CMakeFiles/cb.dir/src/utils/ …
clipboard-jh-0.10.0:
[ 69%] Building CXX object src/cb/CMakeFiles/cb.dir/src/utils/distance.cpp.o
[ 70%] Building CXX object src/cb/CMakeFiles/cb.dir/src/utils/directorysize.cpp.o
[ 72%] Building CXX object src/cb/CMakeFiles/cb.dir/src/utils/cowcopy.cpp.o
[ 73%] Building CXX object src/cb/CMakeFiles/cb.dir/src/platforms/x11wl.cpp.o
[ 74%] Building CXX object src/cb/CMakeFiles/cb.dir/src/platforms/linux.cpp.o
[ 76%] Linking CXX executable ../../cb
[ 76%] Built target cb
make: *** [Makefile:136: all] Error 2
python3.14-ladybug-0.16.0:
| ^~~~~~~~
/build/source/third_party/thrift/transport/TBufferTransports.cpp:120:32: note: ‘uint32_t’ is defined in header ‘<cstdint>’; this is probably fixable by adding ‘#include <cstdint>’
/build/source/third_party/thrift/transport/TBufferTransports.cpp:128:7: error: ‘uint8_t’ does not name a type
128 | const uint8_t* TMemoryBuffer::borrowSlow(uint8_t* buf, uint32_t* len) {
| ^~~~~~~
/build/source/third_party/thrift/transport/TBufferTransports.cpp:128:7: note: ‘uint8_t’ is defined in header ‘<cstdint>’; this is probably fixable by adding ‘#include <cstdint>’
[222/1057] Building CXX object third_party/antlr4_cypher/CMakeFiles/antlr4_cypher.dir/cypher_parser.cpp.o
ninja: build stopped: subcommand failed.
|
| failed |
checks.x86_64-linux.nixos-galena
|
44m 11s |
clipboard-jh-0.10.0:
[ 69%] Building CXX object src/cb/CMakeFiles/cb.dir/src/utils/distance.cpp.o
[ 70%] Building CXX object src/cb/CMakeFiles/cb.dir/src/utils/ …
clipboard-jh-0.10.0:
[ 69%] Building CXX object src/cb/CMakeFiles/cb.dir/src/utils/distance.cpp.o
[ 70%] Building CXX object src/cb/CMakeFiles/cb.dir/src/utils/directorysize.cpp.o
[ 72%] Building CXX object src/cb/CMakeFiles/cb.dir/src/utils/cowcopy.cpp.o
[ 73%] Building CXX object src/cb/CMakeFiles/cb.dir/src/platforms/x11wl.cpp.o
[ 74%] Building CXX object src/cb/CMakeFiles/cb.dir/src/platforms/linux.cpp.o
[ 76%] Linking CXX executable ../../cb
[ 76%] Built target cb
make: *** [Makefile:136: all] Error 2
python3.14-ladybug-0.16.0:
27 | uint32_t TProtocol::skip_virt(TType type) {
| ^~~~~~~~
/build/source/third_party/thrift/protocol/TProtocol.cpp:21:1: note: ‘uint32_t’ is defined in header ‘<cstdint>’; this is probably fixable by adding ‘#include <cstdint>’
20 | #include "protocol/TProtocol.h"
+++ |+#include <cstdint>
21 |
[230/1057] Building CXX object third_party/antlr4_cypher/CMakeFiles/antlr4_cypher.dir/cypher_parser.cpp.o
ninja: build stopped: subcommand failed.
|