direnv-instant-1.3.0
checks.x86_64-linux.home-manager-christophersmith
· build #1381
· raw
unpackPhase
1unpacking source archive /nix/store/2xy7k1ar2i7c4irdn5d20hfx1r9yshp0-source2source root is source3Executing cargoSetupPostUnpackHook4Finished cargoSetupPostUnpackHookpatchPhase
5Executing cargoSetupPostPatchHook6Validating consistency between /build/source/Cargo.lock and /build/cargo-vendor-dir/Cargo.lock7Finished cargoSetupPostPatchHookbuildPhase
8Executing cargoBuildHook9cargoBuildHook flags: -j 16 --target x86_64-unknown-linux-gnu --offline --profile release10 Compiling autocfg v1.5.011 Compiling libc v0.2.18612 Compiling cfg_aliases v0.2.113 Compiling cfg-if v1.0.314 Compiling bitflags v2.9.415 Compiling tinyjson v2.5.116 Compiling nix v0.31.317 Compiling memoffset v0.9.118 Compiling direnv-instant v1.3.0 (/build/source)19 Finished `release` profile [optimized] target(s) in 14.56s20Executing cargoInstallPostBuildHook21Finished cargoInstallPostBuildHook22Finished cargoBuildHookcheckPhase
23Executing cargoCheckHook24cargoCheckHook flags: -j 16 --profile release --target x86_64-unknown-linux-gnu --offline -- --skip blocking_envrc25 Compiling direnv-instant v1.3.0 (/build/source)26 Finished `release` profile [optimized] target(s) in 3.13s27 Running unittests src/main.rs (target/x86_64-unknown-linux-gnu/release/deps/direnv_instant-093e1f807762acf5)2829running 0 tests3031test result: ok. 0 passed; 0 failed; 0 ignored; 0 measured; 0 filtered out; finished in 0.00s3233 Running tests/blocking_envrc_calls_tmux.rs (target/x86_64-unknown-linux-gnu/release/deps/blocking_envrc_calls_tmux-4edbc64d34610306)3435running 0 tests3637test result: ok. 0 passed; 0 failed; 0 ignored; 0 measured; 1 filtered out; finished in 0.00s3839 Running tests/broken_pipe_on_start.rs (target/x86_64-unknown-linux-gnu/release/deps/broken_pipe_on_start-8ec4b2d1a6155980)4041running 1 test42test start_does_not_panic_when_stdout_reader_closes_early ... ok4344test result: ok. 1 passed; 0 failed; 0 ignored; 0 measured; 0 filtered out; finished in 0.11s4546 Running tests/ctrl_c_cancels_in_non_mux_mode.rs (target/x86_64-unknown-linux-gnu/release/deps/ctrl_c_cancels_in_non_mux_mode-d55555ec4d2b51d9)4748running 1 test49test ctrl_c_cancels_direnv_in_non_mux_mode ... ok5051test result: ok. 1 passed; 0 failed; 0 ignored; 0 measured; 0 filtered out; finished in 2.07s5253 Running tests/empty_export_preserves_cache.rs (target/x86_64-unknown-linux-gnu/release/deps/empty_export_preserves_cache-51758de6344667f9)5455running 1 test56test empty_export_preserves_cache ... FAILED5758failures:5960---- empty_export_preserves_cache stdout ----6162thread 'empty_export_preserves_cache' (992) panicked at tests/empty_export_preserves_cache.rs:26:5:63env file not created64note: run with `RUST_BACKTRACE=1` environment variable to display a backtrace656667failures:68 empty_export_preserves_cache6970test result: FAILED. 0 passed; 1 failed; 0 ignored; 0 measured; 0 filtered out; finished in 30.02s7172error: test failed, to rerun pass `--test empty_export_preserves_cache`