setup
checks.x86_64-linux.nixos-electrum
· build #994
· raw
1these 89 derivations will be built:2 /nix/store/0wmzi1chmdin6j769k9rjpqdk7hnagj9-sshd.conf-settings.drv3 /nix/store/01i8absnh4i3bsfz930wbrr3faimb8zr-sshd.conf-final.drv4 /nix/store/d47ahvn5bwkkk3g8kq2hs3s5fpw91naf-hm_.configzsh.zshenv.drv5 /nix/store/9hpjly8qhhhvp76lvpn0cxffjir83gw6-omnigraph-0.11.0.drv6 /nix/store/bxwmmqgaaf3p37wfixmqf6c00m4mvcnl-clipboard-jh-0.10.0.drv7 /nix/store/zpbh1vdsyxn7vylgvfqxnmfg523wjh69-python3.14-ladybug-0.16.0.drv8 /nix/store/rlbcg7fv610mm3wj4vcd90c6kc9mrqzf-python3.14-cognee-1.1.2.drv9 /nix/store/gav70yrp7fy0v4vpk4njk6a1b11v4gbs-cognee.drv10 /nix/store/h89c60g6g2vmihqjavs5cw20ijj03hxl-buzz-cli-0.5.26.drv11 /nix/store/hjahllg23vhac66p3zx7789aaxz2x1gv-buzz.drv12 /nix/store/swhmdd38xdic01iybqjnqj9jjy0vxlx1-bitwarden-cli-2026.9.0.drv13 /nix/store/2nn1pyd29r5ryn4n706j1w4dr04mnxm3-home-manager-path.drv14 /nix/store/lph3bnpr2fh61an3rfpfisipibqm58l4-hm_hmfontconfigfonts.xml.drv15 /nix/store/077idffydgbnxlji515l3v6iy5x0ngh6-home-manager-files.drv16 /nix/store/r4cbarsf5bhnphlvlhwz5gkhcl4z1ri5-etc-sysctl.d-60-nixos.conf.drv17 /nix/store/df0y7p43gy0ymm6vh922fnqzmz8flcr6-X-Restart-Triggers-systemd-sysctl.drv18 /nix/store/0nspj5354biqxdmqfvqbx1yq4k0qrclx-unit-systemd-sysctl.service.drv19 /nix/store/ay7ah8j607883k4cf85cid7bhjmq4nm5-managed-config-omnigent-config-declared.json.drv20 /nix/store/bmn52iqmpf1slcycc7i0d2wxlhrcww1x-managed-config-omnigent-config.json.drv21 /nix/store/0ycb8gbypi1szx38ial8d88c26p2zcm1-activation-script.drv22 /nix/store/1g3z2j6zb1p7vj44dxnrjcypm662vyml-unit-script-sshd-pre-start.drv23 /nix/store/90caz2f6jbczzhh41fp83cnyjigb74kz-check-mountpoints.drv24 /nix/store/sn9gl2i2axlxfa1d20kxhc563px5vvzg-copy-extra-files.drv25 /nix/store/1i1pq70nf0jg6irq1fkaynfp4dpncc1w-systemd-boot.drv26 /nix/store/2f71j79jaqqs6yiclz8mqrbwrq5ql1j6-append-initrd-secrets.drv27 /nix/store/2fhmh3855qxvk3kk3z64j56nvkgsijsb-users-groups.json.drv28 /nix/store/2fmh4a6pm64f35kza0v8k0i0rnqbmhrw-etc-fstab.drv29 /nix/store/8d8zdqbdq9ry1f8sz3239zmfpl2mbbzm-unit-09-zerotier.network.drv30 /nix/store/rkj4v8fxynm1bpb30wr4li2ix9f86jjw-X-Reload-Triggers-systemd-networkd.drv31 /nix/store/2szkammdvkzhfhhqlzca0ybjz0q9469l-unit-systemd-networkd.service.drv32 /nix/store/j4nx5r1gr1mmh72rhiqp0nxf8z71291r-nixos-facter-0.4.4.drv33 /nix/store/7mxqh3yjg8k4h7gs9qp0v96zh2zffnfm-system-path.drv34 /nix/store/sy5fg83rlbjilvqkfd6wnd9f9qw6jxwd-dbus-1.drv35 /nix/store/2xqjg3clpv2bp9wlp2k8clwc69rqf906-X-Restart-Triggers-dbus-broker.drv36 /nix/store/wgh6hadf6rsbl6gnvfi1hqnmkx1nxa8d-firewall-start.drv37 /nix/store/305gh9fy074igqlaixqjjfplnw0qvwsa-firewall-reload.drv38 /nix/store/35dnjkmj2dngrpxf3fdqbl4lj9fvpqw7-unit-cloud-final.service.drv39 /nix/store/38rdw69cz5c88wiq348g11avhr79pjgz-unit-cloud-config.service.drv40 /nix/store/3dsxl28v97paija6jqba46gabd84sy1w-check-sshd-config.drv41 /nix/store/sip7sslprmp1ryiz3cfisw2wx3kv5c6d-hm-putter.json.drv42 /nix/store/492cv4s8bmiswp65j7w1r33rfbm8ds46-home-manager-generation.drv43 /nix/store/s7kk2miv94ay7yd60dcsy2fmz6mh06rj-nixos-tmpfiles.d.drv44 /nix/store/v67mdbisafyh44a26jq6456rgsn01l79-tmpfiles.d.drv45 /nix/store/nfndy2qlx7ab7q1w4hrfxy6c8livvp0c-X-Restart-Triggers-systemd-tmpfiles-resetup.drv46 /nix/store/4hbadw9dsn6yffk4qw97l2hjbsx2qbpl-unit-systemd-tmpfiles-resetup.service.drv47 /nix/store/5kbgsjqbmcgw5fyjrhgnb6g43qllxr95-manifest.json.drv48 /nix/store/5vkk2ilc2cw0wz6q1y84jfmn8zgyhif4-etc-hostname.drv49 /nix/store/k5053sjapq7pzn4agm14pm7103pm3w55-unit-script-sshd-keygen-start.drv50 /nix/store/5yvw8qx55ihwlaj2k2l2r8s6cr7lj761-unit-sshd-keygen.service.drv51 /nix/store/6y3kxz299lzckg8vbpvjbjjzbqa13g4s-initrd-sshd_config.drv52 /nix/store/8gliqxfxbjy2by6qizjcj7sgak4j19rd-ExecStartPre.drv53 /nix/store/iqwwgaakfalmzk8rz2r251sasd96bd2d-initrd-hostname.drv54 /nix/store/j2wm1k6qks8aj7c70glm41hnbaqj1w1c-unit-sshd.service.drv55 /nix/store/ljssaf96s5718bbmzl6dcr25vw9phhiy-initrd-units.drv56 /nix/store/mzgakzzpimqcvdy6099msx432cf2krqr-initrd-shadow.drv57 /nix/store/8z3z9zmjxpd9w4yyd0zpy6rxczqdbzam-initrd-linux-6.18.54.drv58 /nix/store/94h2fabc44l5v1q9al7kyibyh1h68b4i-init-zerotier-identity.drv59 /nix/store/9pzlhms9ibivqr2rp2bnch0hv9i2sanm-unit-systemd-fsck-.service.drv60 /nix/store/iivi4lslz8k67qg0269ljdxmpzhldm4r-set-environment.drv61 /nix/store/9v52fr61vanx7lfgawfdwafdrcm5yrr4-etc-zshenv.drv62 /nix/store/bgzq6j75qfsq52a96c7xh9wdxyj9r7gl-unit-firewall.service.drv63 /nix/store/bw9i4bj5wcflivs5bj7m34nmmhc5cvwv-unit-systemd-makefs-.service.drv64 /nix/store/kfpazxryqs4qhi2dilfkzaqzbdw92fqp-unit-home-manager-cameron.service.drv65 /nix/store/ljr7fi04rz2khkclk9yg0zw3z5h9sw0n-unit-zerotierone.service.drv66 /nix/store/mv3ffpvpfgzwrr7r4pcfpxahqq2ncicc-unit-cloud-init-local.service.drv67 /nix/store/r1mbd2rfdjwbjs6nxwfnyglibgfm6a1h-unit-tor.service.drv68 /nix/store/r5300xlywal0q64hj026aym4y47lgy5a-unit-dbus-broker.service.drv69 /nix/store/f9srpqv7mc2by7dkl4r6zgav6fwmdi15-X-Restart-Triggers-sshd.drv70 /nix/store/rpi0rwi9wgywxg6gax7ikixqzqckn0gj-unit-sshd.service.drv71 /nix/store/wdng4gl5jviizl6m4n44x256g98m9lim-unit-cloud-init.service.drv72 /nix/store/czbbbsdvxwhzs6g4mrjsiaw71nwjy86f-system-units.drv73 /nix/store/dlv03i3ar7026vxjgm718z98x7f8q8ib-etc-ssh-ssh_known_hosts.drv74 /nix/store/fyxklgl9xckz8bjiysj6wdf86xmdf2a0-system-generators.drv75 /nix/store/gfh1vr30kr5hf0b68jnhklxg8hj36xw7-boot.json.drv76 /nix/store/hail6a52k6a46cw9msx2gzcbwm7zcfa3-etc-profile.drv77 /nix/store/ygwwgxvaq3g9hq8rkc5c9id79yaqp74n-string-hosts.drv78 /nix/store/icklj34brzc37lni2jdwhdlyvhga2pmk-hosts.drv79 /nix/store/wyjcg2zb3jbxxjfq580q305j75plcgxd-unit-dbus-broker.service.drv80 /nix/store/ifaazhkhl79q0gpq1cprbj732y8xp76f-user-units.drv81 /nix/store/n6lzwbr63pff32kp5jynaqx0w1z91nii-system-shutdown.drv82 /nix/store/s9l26wrfcv05z4d87pzikljph1xy35h1-etc-systemd-system.conf.drv83 /nix/store/vyvl1hx9g91nrkg1bzxliwib7df0kl96-user-environment.drv84 /nix/store/wx0i45vnqk8nyqyich2lv5frfdwdjxp0-user-generators.drv85 /nix/store/kmc7csx0nrc3q62hni21pv3wygpiwyhl-etc.drv86 /nix/store/jv087d1iw1mc0h88b0f9gpc01rj9kh8w-activate.drv87 /nix/store/m335q4pkhwf8ajnbn1ig9fnfhvq7w8hz-pre-switch-checks.drv88 /nix/store/q3ddrbvx66a5vcgczgr60dcnfns3figk-dry-activate.drv89 /nix/store/s952bm56rcgyb9g1rxjgy0w0qfcyilh5-install-systemd-boot.sh.drv90 /nix/store/w5b8lh3alz8jcdwvicv4kj7dwn9my1vk-nixos-system-electrum-26.11.20261002.af0493c.drv91these 5 paths will be fetched (0.0 KiB download, 367.2 KiB unpacked):92 /nix/store/569pgbbykxqzpzxvdkfj9sz9dr1ga6vk-mtools-4.0.4993 /nix/store/bvx31xiiqp2ds1dxd9fbx9c601qrgnzz-mtools-4.0.49-man94 /nix/store/kmnfdl5jj0g3jax01kjm6h7lj7d6iwyz-systemd-boot95 /nix/store/pfjhr8m504hqm9z70q1d5jj5scyi9px7-systemd-generator-environment.json96 /nix/store/wlq2alxm5ryhml6ps10j1ndknkd4ad2i-zerotierone-1.16.0-man97error: Cannot build '/nix/store/bxwmmqgaaf3p37wfixmqf6c00m4mvcnl-clipboard-jh-0.10.0.drv'.98 Reason: builder failed with exit code 2.99 Output paths:100 /nix/store/ya6hd9wp9zq4q9q9jcilyz2if5703s69-clipboard-jh-0.10.0101 Last 25 log lines:102 > [ 48%] Building CXX object src/cb/CMakeFiles/cb.dir/src/actions/undo.cpp.o103 > [ 49%] Building CXX object src/cb/CMakeFiles/cb.dir/src/actions/redo.cpp.o104 > [ 50%] Building CXX object src/cb/CMakeFiles/cb.dir/src/actions/script.cpp.o105 > [ 52%] Building CXX object src/cb/CMakeFiles/cb.dir/src/actions/share.cpp.o106 > [ 53%] Building CXX object src/cb/CMakeFiles/cb.dir/src/locales/en_us.cpp.o107 > [ 54%] Building CXX object src/cb/CMakeFiles/cb.dir/src/locales/es_co.cpp.o108 > [ 56%] Building CXX object src/cb/CMakeFiles/cb.dir/src/locales/es_do.cpp.o109 > [ 57%] Linking CXX shared module ../../libcbx11.so110 > [ 58%] Building CXX object src/cb/CMakeFiles/cb.dir/src/locales/pt_br.cpp.o111 > [ 60%] Building CXX object src/cb/CMakeFiles/cb.dir/src/locales/tr_tr.cpp.o112 > [ 61%] Building CXX object src/cb/CMakeFiles/cb.dir/src/locales/de_de.cpp.o113 > [ 62%] Building CXX object src/cb/CMakeFiles/cb.dir/src/locales/fr_fr.cpp.o114 > [ 62%] Built target cbx11115 > [ 64%] Building CXX object src/cb/CMakeFiles/cb.dir/src/utils/editors.cpp.o116 > [ 65%] Building CXX object src/cb/CMakeFiles/cb.dir/src/utils/utils.cpp.o117 > [ 66%] Building CXX object src/cb/CMakeFiles/cb.dir/src/utils/formatting.cpp.o118 > [ 68%] Building CXX object src/cb/CMakeFiles/cb.dir/src/utils/files.cpp.o119 > [ 69%] Building CXX object src/cb/CMakeFiles/cb.dir/src/utils/distance.cpp.o120 > [ 70%] Building CXX object src/cb/CMakeFiles/cb.dir/src/utils/directorysize.cpp.o121 > [ 72%] Building CXX object src/cb/CMakeFiles/cb.dir/src/utils/cowcopy.cpp.o122 > [ 73%] Building CXX object src/cb/CMakeFiles/cb.dir/src/platforms/x11wl.cpp.o123 > [ 74%] Building CXX object src/cb/CMakeFiles/cb.dir/src/platforms/linux.cpp.o124 > [ 76%] Linking CXX executable ../../cb125 > [ 76%] Built target cb126 > make: *** [Makefile:136: all] Error 2127 For full logs, run:128 nix log /nix/store/bxwmmqgaaf3p37wfixmqf6c00m4mvcnl-clipboard-jh-0.10.0.drv129error: Cannot build '/nix/store/zpbh1vdsyxn7vylgvfqxnmfg523wjh69-python3.14-ladybug-0.16.0.drv'.130 Reason: builder failed with exit code 1.131 Output paths:132 /nix/store/p4h2643j2w3pwwvs7fc420j929na67b9-python3.14-ladybug-0.16.0-dist133 /nix/store/qanhkvnlpvbl468i05swp73klix5l73k-python3.14-ladybug-0.16.0134 Last 25 log lines:135 > 112 | void TMemoryBuffer::writeSlow(const uint8_t* buf, uint32_t len) {136 > | ^~~~~~~137 > /build/source/third_party/thrift/transport/TBufferTransports.cpp:112:37: note: ‘uint8_t’ is defined in header ‘<cstdint>’; this is probably fixable by adding ‘#include <cstdint>’138 > /build/source/third_party/thrift/transport/TBufferTransports.cpp:112:51: error: ‘uint32_t’ has not been declared139 > 112 | void TMemoryBuffer::writeSlow(const uint8_t* buf, uint32_t len) {140 > | ^~~~~~~~141 > /build/source/third_party/thrift/transport/TBufferTransports.cpp:112:51: note: ‘uint32_t’ is defined in header ‘<cstdint>’; this is probably fixable by adding ‘#include <cstdint>’142 > /build/source/third_party/thrift/transport/TBufferTransports.cpp: In member function ‘virtual void lbug_apache::thrift::transport::TMemoryBuffer::writeSlow(const int*, int)’:143 > /build/source/third_party/thrift/transport/TBufferTransports.cpp:116:10: error: ‘wBase_’ was not declared in this scope144 > 116 | memcpy(wBase_, buf, len);145 > | ^~~~~~146 > /build/source/third_party/thrift/transport/TBufferTransports.cpp: At global scope:147 > /build/source/third_party/thrift/transport/TBufferTransports.cpp:120:6: error: variable or field ‘wroteBytes’ declared void148 > 120 | void TMemoryBuffer::wroteBytes(uint32_t len) {149 > | ^~~~~~~~~~~~~150 > /build/source/third_party/thrift/transport/TBufferTransports.cpp:120:32: error: ‘uint32_t’ was not declared in this scope151 > 120 | void TMemoryBuffer::wroteBytes(uint32_t len) {152 > | ^~~~~~~~153 > /build/source/third_party/thrift/transport/TBufferTransports.cpp:120:32: note: ‘uint32_t’ is defined in header ‘<cstdint>’; this is probably fixable by adding ‘#include <cstdint>’154 > /build/source/third_party/thrift/transport/TBufferTransports.cpp:128:7: error: ‘uint8_t’ does not name a type155 > 128 | const uint8_t* TMemoryBuffer::borrowSlow(uint8_t* buf, uint32_t* len) {156 > | ^~~~~~~157 > /build/source/third_party/thrift/transport/TBufferTransports.cpp:128:7: note: ‘uint8_t’ is defined in header ‘<cstdint>’; this is probably fixable by adding ‘#include <cstdint>’158 > [222/1057] Building CXX object third_party/antlr4_cypher/CMakeFiles/antlr4_cypher.dir/cypher_parser.cpp.o159 > ninja: build stopped: subcommand failed.160 For full logs, run:161 nix log /nix/store/zpbh1vdsyxn7vylgvfqxnmfg523wjh69-python3.14-ladybug-0.16.0.drv162error: Cannot build '/nix/store/rlbcg7fv610mm3wj4vcd90c6kc9mrqzf-python3.14-cognee-1.1.2.drv'.163 Reason: 1 dependency failed.164 Output paths:165 /nix/store/33nq4xrpdkh7dpsxb621vl1237z8srqf-python3.14-cognee-1.1.2-dist166 /nix/store/zk7xwifqpq272ipbaca85fkrpfymca3k-python3.14-cognee-1.1.2167error: Cannot build '/nix/store/gav70yrp7fy0v4vpk4njk6a1b11v4gbs-cognee.drv'.168 Reason: 1 dependency failed.169 Output paths:170 /nix/store/6i7qk5vll5vsiyplxmwj2gp6rj7jq549-cognee171error: Cannot build '/nix/store/2nn1pyd29r5ryn4n706j1w4dr04mnxm3-home-manager-path.drv'.172 Reason: 3 dependencies failed.173 Output paths:174 /nix/store/bfhsnk574w2xwym2iqmmmsmm14k137m2-home-manager-path175error: Cannot build '/nix/store/lph3bnpr2fh61an3rfpfisipibqm58l4-hm_hmfontconfigfonts.xml.drv'.176 Reason: 1 dependency failed.177 Output paths:178 /nix/store/7k6hd0sm4y1b5mg2hc6y877vrxymhm95-hm_hmfontconfigfonts.xml179error: Cannot build '/nix/store/vyvl1hx9g91nrkg1bzxliwib7df0kl96-user-environment.drv'.180 Reason: 1 dependency failed.181 Output paths:182 /nix/store/xzx764v1y789nbnhmj7il896gsyqzj8s-user-environment183error: Cannot build '/nix/store/077idffydgbnxlji515l3v6iy5x0ngh6-home-manager-files.drv'.184 Reason: 1 dependency failed.185 Output paths:186 /nix/store/0jv7qcnmy4l7hqv0z0sphc7y8m30bsw3-home-manager-files187error: Cannot build '/nix/store/sip7sslprmp1ryiz3cfisw2wx3kv5c6d-hm-putter.json.drv'.188 Reason: 1 dependency failed.189 Output paths:190 /nix/store/50n8vbq1j21qn3mmp73hc70c00q1w6jr-hm-putter.json191error: Cannot build '/nix/store/492cv4s8bmiswp65j7w1r33rfbm8ds46-home-manager-generation.drv'.192 Reason: 3 dependencies failed.193 Output paths:194 /nix/store/x40ypj74s06ih05s0qdkdnq64fgynnml-home-manager-generation195error: Cannot build '/nix/store/kfpazxryqs4qhi2dilfkzaqzbdw92fqp-unit-home-manager-cameron.service.drv'.196 Reason: 1 dependency failed.197 Output paths:198 /nix/store/0d8z6dv0xykbkzfmnmzykl2j8bhmymny-unit-home-manager-cameron.service199error: Cannot build '/nix/store/czbbbsdvxwhzs6g4mrjsiaw71nwjy86f-system-units.drv'.200 Reason: 1 dependency failed.201 Output paths:202 /nix/store/fs1dmwy8gvgvx8nrmisl96nklm6favb0-system-units203error: Cannot build '/nix/store/kmc7csx0nrc3q62hni21pv3wygpiwyhl-etc.drv'.204 Reason: 2 dependencies failed.205 Output paths:206 /nix/store/3c20s7cn6wca274hla4f69zvjpag3k14-etc207error: Cannot build '/nix/store/jv087d1iw1mc0h88b0f9gpc01rj9kh8w-activate.drv'.208 Reason: 1 dependency failed.209 Output paths:210 /nix/store/z32hmc47b7jfy68aszhcz9n3ga67pql2-activate211error: Cannot build '/nix/store/w5b8lh3alz8jcdwvicv4kj7dwn9my1vk-nixos-system-electrum-26.11.20261002.af0493c.drv'.212 Reason: 2 dependencies failed.213 Output paths:214 /nix/store/yd7ca9nrff93a4xxc22z0xkvcdgmszfn-nixos-system-electrum-26.11.20261002.af0493c