nixbot

builds

failed clipboard-jh-0.10.0 checks.x86_64-linux.nixos-electrum · build #994 · raw

unpackPhase
1unpacking source archive /nix/store/i1ws50gam26w911pfavjc2033gx2q5aw-source2source root is source
configurePhase
3cmake flags: -DCMAKE_FIND_USE_SYSTEM_PACKAGE_REGISTRY=OFF -DCMAKE_FIND_USE_PACKAGE_REGISTRY=OFF -DCMAKE_EXPORT_NO_PACKAGE_REGISTRY=ON -DCMAKE_BUILD_TYPE=MinSizeRel -DBUILD_TESTING=OFF -DCMAKE_INSTALL_LOCALEDIR=/nix/store/ya6hd9wp9zq4q9q9jcilyz2if5703s69-clipboard-jh-0.10.0/share/locale -DCMAKE_INSTALL_LIBEXECDIR=/nix/store/ya6hd9wp9zq4q9q9jcilyz2if5703s69-clipboard-jh-0.10.0/libexec -DCMAKE_INSTALL_LIBDIR=/nix/store/ya6hd9wp9zq4q9q9jcilyz2if5703s69-clipboard-jh-0.10.0/lib -DCMAKE_INSTALL_DOCDIR=/nix/store/ya6hd9wp9zq4q9q9jcilyz2if5703s69-clipboard-jh-0.10.0/share/doc/Clipboard -DCMAKE_INSTALL_INFODIR=/nix/store/ya6hd9wp9zq4q9q9jcilyz2if5703s69-clipboard-jh-0.10.0/share/info -DCMAKE_INSTALL_MANDIR=/nix/store/ya6hd9wp9zq4q9q9jcilyz2if5703s69-clipboard-jh-0.10.0/share/man -DCMAKE_INSTALL_INCLUDEDIR=/nix/store/ya6hd9wp9zq4q9q9jcilyz2if5703s69-clipboard-jh-0.10.0/include -DCMAKE_INSTALL_SBINDIR=/nix/store/ya6hd9wp9zq4q9q9jcilyz2if5703s69-clipboard-jh-0.10.0/sbin -DCMAKE_INSTALL_BINDIR=/nix/store/ya6hd9wp9zq4q9q9jcilyz2if5703s69-clipboard-jh-0.10.0/bin -DCMAKE_INSTALL_NAME_DIR=/nix/store/ya6hd9wp9zq4q9q9jcilyz2if5703s69-clipboard-jh-0.10.0/lib -DCMAKE_STRIP=/nix/store/j1938gsbvbhkyz4kbmvjk56r479mkw3s-gcc-wrapper-16.2.0/bin/strip -DCMAKE_RANLIB=/nix/store/j1938gsbvbhkyz4kbmvjk56r479mkw3s-gcc-wrapper-16.2.0/bin/ranlib -DCMAKE_AR=/nix/store/j1938gsbvbhkyz4kbmvjk56r479mkw3s-gcc-wrapper-16.2.0/bin/ar -DCMAKE_C_COMPILER=gcc -DCMAKE_CXX_COMPILER=g++ -DCMAKE_INSTALL_PREFIX=/nix/store/ya6hd9wp9zq4q9q9jcilyz2if5703s69-clipboard-jh-0.10.0 -Wno-dev -DINSTALL_PREFIX=/nix/store/ya6hd9wp9zq4q9q9jcilyz2if5703s69-clipboard-jh-0.10.04The no-dev option is deprecated. Use -Wno-author instead.5-- The CXX compiler identification is GNU 16.2.06-- The C compiler identification is GNU 16.2.07-- Detecting CXX compiler ABI info8-- Detecting CXX compiler ABI info - done9-- Check for working CXX compiler: /nix/store/j1938gsbvbhkyz4kbmvjk56r479mkw3s-gcc-wrapper-16.2.0/bin/g++ - skipped10-- Detecting CXX compile features11-- Detecting CXX compile features - done12-- Detecting C compiler ABI info13-- Detecting C compiler ABI info - done14-- Check for working C compiler: /nix/store/j1938gsbvbhkyz4kbmvjk56r479mkw3s-gcc-wrapper-16.2.0/bin/gcc - skipped15-- Detecting C compile features16-- Detecting C compile features - done17-- Found ALSA: /nix/store/xlqm12gx3s3f7dc1a5pnfk4p2niw2lri-alsa-lib-1.2.16.1/lib/libasound.so (found version "1.2.16.1")18-- Looking for fork19-- Looking for fork - found20-- Found X11: /nix/store/zhqvgsbq8ridrhr67qbxnq8rrbx6hvfj-xorgproto-2025.1/include21-- Looking for XOpenDisplay in /nix/store/znrm90algr0fvnnnp130am1qfg59nl1f-libx11-1.8.13/lib/libX11.so22-- Looking for XOpenDisplay in /nix/store/znrm90algr0fvnnnp130am1qfg59nl1f-libx11-1.8.13/lib/libX11.so - found23-- Looking for gethostbyname24-- Looking for gethostbyname - found25-- Looking for connect26-- Looking for connect - found27-- Looking for remove28-- Looking for remove - found29-- Looking for shmat30-- Looking for shmat - found31-- Building the Clipboard Project with X11 support32-- Found PkgConfig: /nix/store/b9izmrfjp0qnnyahdwwrzdwi87s1h179-pkg-config-wrapper-0.29.2/bin/pkg-config (found version "0.29.2")33-- Checking for modules 'wayland-client;wayland-protocols'34-- Found wayland-client, version 1.26.035-- Found wayland-protocols, version 1.4936-- Building the Clipboard Project with Wayland support37-- Performing Test CMAKE_HAVE_LIBC_PTHREAD38-- Performing Test CMAKE_HAVE_LIBC_PTHREAD - Success39-- Found Threads: TRUE40-- Found OpenSSL: /nix/store/cxd8d2vg70c3pa31v2473hphaa1v0j44-openssl-3.5.8/lib/libcrypto.so (found version "3.5.8")41-- Configuring done (16.7s)42-- Generating done (0.1s)43CMake Warning (unused-cli):44 Manually-specified variables were not used by the project:4546 BUILD_TESTING47 CMAKE_EXPORT_NO_PACKAGE_REGISTRY48 CMAKE_INSTALL_BINDIR49 CMAKE_INSTALL_DOCDIR50 CMAKE_INSTALL_INCLUDEDIR51 CMAKE_INSTALL_INFODIR52 CMAKE_INSTALL_LIBEXECDIR53 CMAKE_INSTALL_LOCALEDIR54 CMAKE_INSTALL_MANDIR55 CMAKE_INSTALL_SBINDIR56 INSTALL_PREFIX575859-- Build files have been written to: /build/source/build60cmake: enabled parallel building61cmake: enabled parallel installing
buildPhase
62build flags: -j16 SHELL=/nix/store/10dxp0qxqxxsyiljrh2kp0xqhz6arhcx-bash-5.3p15/bin/bash63[ 1%] Generating generated/include/wayland-xdg-shell.hpp64[ 2%] Building CXX object src/gui/CMakeFiles/gui.dir/src/fork.cpp.o65[ 4%] Building CXX object src/gui/CMakeFiles/gui.dir/src/utils.cpp.o66[ 5%] Building CXX object src/gui/CMakeFiles/gui.dir/src/x11wl/mime.cpp.o67[ 6%] Building CXX object src/gui/CMakeFiles/gui.dir/src/inferextension.cpp.o68[ 8%] Building CXX object src/gui/CMakeFiles/gui.dir/src/infermime.cpp.o69[ 9%] Building CXX object src/gui/CMakeFiles/gui.dir/src/gui.cpp.o70[ 9%] Built target cbwayland_generatedheaders71[ 10%] Linking CXX static library ../../libgui.a72[ 10%] Built target gui73[ 12%] Generating generated/src/wayland-xdg-shell.c74[ 13%] Building CXX object src/cbx11/CMakeFiles/cbx11.dir/src/x11.cpp.o75[ 14%] Building CXX object src/cb/CMakeFiles/cb.dir/src/clipboard.cpp.o76[ 16%] Building CXX object src/cb/CMakeFiles/cb.dir/src/main.cpp.o77[ 17%] Building CXX object src/cb/CMakeFiles/cb.dir/src/themes.cpp.o78[ 18%] Building CXX object src/cb/CMakeFiles/cb.dir/src/indicator.cpp.o79[ 20%] Building CXX object src/cb/CMakeFiles/cb.dir/src/externalclipboards.cpp.o80[ 21%] Building CXX object src/cb/CMakeFiles/cb.dir/src/actions/clear.cpp.o81[ 22%] Building CXX object src/cb/CMakeFiles/cb.dir/src/actions/add.cpp.o82[ 24%] Building CXX object src/cb/CMakeFiles/cb.dir/src/actions/copy.cpp.o83[ 25%] Building CXX object src/cb/CMakeFiles/cb.dir/src/actions/config.cpp.o84[ 26%] Building CXX object src/cb/CMakeFiles/cb.dir/src/actions/edit.cpp.o85[ 28%] Building CXX object src/cb/CMakeFiles/cb.dir/src/actions/import.cpp.o86[ 30%] Building CXX object src/cb/CMakeFiles/cb.dir/src/actions/history.cpp.o87[ 30%] Building CXX object src/cb/CMakeFiles/cb.dir/src/actions/export.cpp.o88[ 32%] Building CXX object src/cb/CMakeFiles/cb.dir/src/actions/ignore.cpp.o89[ 33%] Building CXX object src/cbwayland/CMakeFiles/cbwayland.dir/src/fd.cpp.o90[ 34%] Building CXX object src/cb/CMakeFiles/cb.dir/src/actions/info.cpp.o91[ 36%] Building CXX object src/cb/CMakeFiles/cb.dir/src/actions/load.cpp.o92[ 37%] Building CXX object src/cb/CMakeFiles/cb.dir/src/actions/note.cpp.o93[ 38%] Building CXX object src/cb/CMakeFiles/cb.dir/src/actions/paste.cpp.o94[ 40%] Building CXX object src/cb/CMakeFiles/cb.dir/src/actions/pipeinout.cpp.o95/build/source/src/cbwayland/src/fd.cpp: In member function 'std::size_t FdBuffer::constrainSize(std::size_t) const':96/build/source/src/cbwayland/src/fd.cpp:146:52: error: 'SSIZE_MAX' was not declared in this scope; did you mean 'SIZE_MAX'?97 146 | return std::min(size, static_cast<std::size_t>(SSIZE_MAX));98 | ^~~~~~~~~99 | SIZE_MAX100[ 41%] Building CXX object src/cb/CMakeFiles/cb.dir/src/actions/remove.cpp.o101[ 42%] Building CXX object src/cb/CMakeFiles/cb.dir/src/actions/search.cpp.o102[ 44%] Building CXX object src/cb/CMakeFiles/cb.dir/src/actions/show.cpp.o103make[2]: *** [src/cbwayland/CMakeFiles/cbwayland.dir/build.make:83: src/cbwayland/CMakeFiles/cbwayland.dir/src/fd.cpp.o] Error 1104make[1]: *** [CMakeFiles/Makefile2:273: src/cbwayland/CMakeFiles/cbwayland.dir/all] Error 2105make[1]: *** Waiting for unfinished jobs....106[ 45%] Building CXX object src/cb/CMakeFiles/cb.dir/src/actions/status.cpp.o107[ 46%] Building CXX object src/cb/CMakeFiles/cb.dir/src/actions/swap.cpp.o108[ 48%] Building CXX object src/cb/CMakeFiles/cb.dir/src/actions/undo.cpp.o109[ 49%] Building CXX object src/cb/CMakeFiles/cb.dir/src/actions/redo.cpp.o110[ 50%] Building CXX object src/cb/CMakeFiles/cb.dir/src/actions/script.cpp.o111[ 52%] Building CXX object src/cb/CMakeFiles/cb.dir/src/actions/share.cpp.o112[ 53%] Building CXX object src/cb/CMakeFiles/cb.dir/src/locales/en_us.cpp.o113[ 54%] Building CXX object src/cb/CMakeFiles/cb.dir/src/locales/es_co.cpp.o114[ 56%] Building CXX object src/cb/CMakeFiles/cb.dir/src/locales/es_do.cpp.o115[ 57%] Linking CXX shared module ../../libcbx11.so116[ 58%] Building CXX object src/cb/CMakeFiles/cb.dir/src/locales/pt_br.cpp.o117[ 60%] Building CXX object src/cb/CMakeFiles/cb.dir/src/locales/tr_tr.cpp.o118[ 61%] Building CXX object src/cb/CMakeFiles/cb.dir/src/locales/de_de.cpp.o119[ 62%] Building CXX object src/cb/CMakeFiles/cb.dir/src/locales/fr_fr.cpp.o120[ 62%] Built target cbx11121[ 64%] Building CXX object src/cb/CMakeFiles/cb.dir/src/utils/editors.cpp.o122[ 65%] Building CXX object src/cb/CMakeFiles/cb.dir/src/utils/utils.cpp.o123[ 66%] Building CXX object src/cb/CMakeFiles/cb.dir/src/utils/formatting.cpp.o124[ 68%] Building CXX object src/cb/CMakeFiles/cb.dir/src/utils/files.cpp.o125[ 69%] Building CXX object src/cb/CMakeFiles/cb.dir/src/utils/distance.cpp.o126[ 70%] Building CXX object src/cb/CMakeFiles/cb.dir/src/utils/directorysize.cpp.o127[ 72%] Building CXX object src/cb/CMakeFiles/cb.dir/src/utils/cowcopy.cpp.o128[ 73%] Building CXX object src/cb/CMakeFiles/cb.dir/src/platforms/x11wl.cpp.o129[ 74%] Building CXX object src/cb/CMakeFiles/cb.dir/src/platforms/linux.cpp.o130[ 76%] Linking CXX executable ../../cb131[ 76%] Built target cb132make: *** [Makefile:136: all] Error 2