setup
checks.x86_64-linux.nixos-galena
· build #994
· raw
1these 98 derivations will be built:2 /nix/store/0jyfbwx625140mjzc9x74xdmjbcrx901-extra-udev-rules.drv3 /nix/store/n47n823qpn0nhmmznajiqhmv6lra63lk-sshd.conf-settings.drv4 /nix/store/pi8aybqj0hy1nwazch65b3yifrrzndny-sshd.conf-final.drv5 /nix/store/0nq10fjgccxdzszy0xm6g29vv2rxy9h5-X-Restart-Triggers-sshd.drv6 /nix/store/52pxxvr5xz8wdixmkrgf38h0wxnvx9bj-etc-sysctl.d-60-nixos.conf.drv7 /nix/store/256irc1cs6112alcb9h4kp4cpqjk51mq-X-Restart-Triggers-systemd-sysctl.drv8 /nix/store/55n6n1pa3jnkn1s421adqdw62jwwf4dm-hm-session-vars.sh.drv9 /nix/store/2h3x6pawgp5801085jnh9z6cwidiynpd-hm_.configzsh.zshenv.drv10 /nix/store/9hpjly8qhhhvp76lvpn0cxffjir83gw6-omnigraph-0.11.0.drv11 /nix/store/bxwmmqgaaf3p37wfixmqf6c00m4mvcnl-clipboard-jh-0.10.0.drv12 /nix/store/zpbh1vdsyxn7vylgvfqxnmfg523wjh69-python3.14-ladybug-0.16.0.drv13 /nix/store/rlbcg7fv610mm3wj4vcd90c6kc9mrqzf-python3.14-cognee-1.1.2.drv14 /nix/store/gav70yrp7fy0v4vpk4njk6a1b11v4gbs-cognee.drv15 /nix/store/h89c60g6g2vmihqjavs5cw20ijj03hxl-buzz-cli-0.5.26.drv16 /nix/store/hjahllg23vhac66p3zx7789aaxz2x1gv-buzz.drv17 /nix/store/swhmdd38xdic01iybqjnqj9jjy0vxlx1-bitwarden-cli-2026.9.0.drv18 /nix/store/2nn1pyd29r5ryn4n706j1w4dr04mnxm3-home-manager-path.drv19 /nix/store/2wdhjrnqxl2lszpzxmfpb3j2zia30bk9-tmpfiles.d.drv20 /nix/store/2x14b63cxip1k6pzznpwkim9dvnacad9-tara-authorized_keys.drv21 /nix/store/xf7psb1lz7f06vb5xvfvlfxl6i2rspvi-manifest.json.drv22 /nix/store/ccyzhz278gqhbxdzdy4p9sgsyv5gjssi-sops-nix-user.drv23 /nix/store/3mag3647y8ymqrbvwpxhh2p48fhla7n7-sops-nix.service.drv24 /nix/store/gmhl00nxf05wrvm44sxnp8maymffl3zq-udev-rules.drv25 /nix/store/3szfcqf2vapv20rbvcrv1yh7cvcfrqbv-X-Restart-Triggers-systemd-udevd.drv26 /nix/store/m8c3mcxp8skamdckkqzlcl7s2vg7i4y5-managed-config-omnigent-config-declared.json.drv27 /nix/store/4gxpy06d2vx1y88c6jxa4p8czsiiiw19-managed-config-omnigent-config.json.drv28 /nix/store/hrlbjnkmqlk7cgm27kya13h7xsg54axs-hm-session-vars.fish.drv29 /nix/store/882afnnzvfgwy669fmjz7m7xhnspzan4-config.fish.drv30 /nix/store/hq8h3l1x7k6f7lqpr9any0mqhm9g0gcc-hm_environment.d10homemanager.conf.drv31 /nix/store/v956hdg9r3pwq387r89gj1p9pqb7876p-home-manager-path.drv32 /nix/store/hzfwqcyqfifl9ibbcwgi8i5rd50qych0-hm_hmfontconfigfonts.xml.drv33 /nix/store/k8fipxh5sr91cvqq7g7m42gvih00679i-profile.drv34 /nix/store/qfydz7dw1y1vj80n8dx67pigsb3xl43i-hm_.configzsh.zprofile.drv35 /nix/store/p24pglsbk88067kdsdn2azhvx32i8m61-home-manager-files.drv36 /nix/store/5685dyf3h774cc1mvxm7yw8h03k8vrsn-hm-putter.json.drv37 /nix/store/lph3bnpr2fh61an3rfpfisipibqm58l4-hm_hmfontconfigfonts.xml.drv38 /nix/store/lyn68l2iskalfqw76iz68c1inymi7v9f-hm_.configzsh.zshenv.drv39 /nix/store/6fdway03vq14jhcg0kz67jlwxx3vgnh2-home-manager-files.drv40 /nix/store/7big25gpdnlr8jn8aay4wq58zc4smy0y-hm-putter.json.drv41 /nix/store/gc7giflv6s62iyj94hvfrwimbmx7x3xd-activation-script.drv42 /nix/store/b218srvb1jrm3fbbzimqqlckzvqxlwck-home-manager-generation.drv43 /nix/store/61w3bbqrj12f3169cdxchvy4ja6dqpa6-unit-home-manager-cameron.service.drv44 /nix/store/7sz28c2l4crmyw4dkdvzmzwbhzvqkji5-append-initrd-secrets.drv45 /nix/store/9mklbipxyakpr2y38yls5p70b5xymv3p-initrd-nixos.conf.drv46 /nix/store/cqldfl835zx9jcadk12001adfll76188-unit-script-sshd-pre-start.drv47 /nix/store/cypsy3vj49q9ydn06hm9lb4ca5bx4fw8-initrd-shadow.drv48 /nix/store/iznvfayf3ldiw2i4niv1hs5wmfv9cgs9-initrd-hostname.drv49 /nix/store/mhkcmx4znxs1nk8dya0rf32k01c62mqc-unit-sshd.service.drv50 /nix/store/k9j2k6d8wxq1c9r1vhl6ghany0ykfrfs-initrd-units.drv51 /nix/store/p5815v38hj8kh44dvhhgkw2cbylavwv0-unit-40-ens4.network.drv52 /nix/store/wfd39xq7mc0h1mh1wclsif63fi9m9pid-initrd-sshd_config.drv53 /nix/store/xj4hk5n9yh9qskixas6lcq5pil36bxsj-linux-6.18.54-modules-shrunk.drv54 /nix/store/yzfy5qvayj74jg3xpwd61l9nczx868yq-initrd-linux-6.18.54.drv55 /nix/store/6lba4qy329gi248gqfjbpkl8mzany8rb-boot.json.drv56 /nix/store/82wkks2d4bpbpafn40131nmm4czlzm9q-etc-ssh-ssh_known_hosts.drv57 /nix/store/8g89k23nyg4k9198cdd6vf4r41s76xj8-user-environment.drv58 /nix/store/j4nx5r1gr1mmh72rhiqp0nxf8z71291r-nixos-facter-0.4.4.drv59 /nix/store/zf4kylbwjp5xkrqzxrp2y9rz0mmfbz4w-system-path.drv60 /nix/store/hxxsi5i4vc9k9yb9pc2f10rpwam9kwg9-dbus-1.drv61 /nix/store/a6p2pwz8slx7gh524b36zfzss1xs1m20-X-Restart-Triggers-dbus-broker.drv62 /nix/store/9cdf4pwipg2h0ahxi8wcqjxgypmznfm9-unit-dbus-broker.service.drv63 /nix/store/95ycd0iqwjqlgyllg8wwgrp5mq76gk7k-user-units.drv64 /nix/store/mvlg5n9qrf942xmf1bl58q48yxas8psa-X-Restart-Triggers-systemd-tmpfiles-resetup.drv65 /nix/store/9n965yfdk28ip0bigdn6x5pj1fp936p2-unit-systemd-tmpfiles-resetup.service.drv66 /nix/store/abhq9s9crlqbh1c5siqp6yl7wcyykp4j-unit-script-sshd-keygen-start.drv67 /nix/store/jmv9p9hm3nr1wyxvf5524x6j2s43xhjc-users-groups.json.drv68 /nix/store/m5kd8394403w0040f0akkf8qqn5ypv60-manifest.json.drv69 /nix/store/rrvpawjqrfjhcqc7sqdl7bmk1n30s2lg-manifest-for-users.json.drv70 /nix/store/af79jriflh5mimxchl2cjvzkqbxxa3jm-dry-activate.drv71 /nix/store/aish6ggi6i7hmddx2airdrknq4yxrzhd-unit-systemd-udevd.service.drv72 /nix/store/ayycp78rx1clf3h5zqnlkkmbj9imwf8x-hwdb.bin.drv73 /nix/store/b7fq49jdy53q49kddjl1a18yhq9swmwk-unit-sshd-keygen.service.drv74 /nix/store/bx1h2m6z8qxi62jkwqarlmy9i931lqy4-activation-script.drv75 /nix/store/d8dsfw079ghjnihswygyzkii6f63ccr3-check-sshd-config.drv76 /nix/store/dinxvkj5i3kxilqn2vynd0qa93qh9y3c-unit-dbus-broker.service.drv77 /nix/store/f72jb24ad5qkzrpbvp208bgxmii3px8v-unit-10-uplink.network.drv78 /nix/store/fyxklgl9xckz8bjiysj6wdf86xmdf2a0-system-generators.drv79 /nix/store/gg1p14m8m0gr8jcfm7fnbklxhv3aq33r-init-zerotier-identity.drv80 /nix/store/gmp3rfabifanahjx6b8784c4g4zndms3-etc-hostname.drv81 /nix/store/j8xq5y317d5367bxdrkvpsj1b2clhpv8-pre-switch-checks.drv82 /nix/store/jfqpdmpg3fz2a3yvqj34vkzgwxlb317p-string-hosts.drv83 /nix/store/jwcv8naysn5d08x5wwxivnb7giwf7km4-ExecStartPre.drv84 /nix/store/n6lzwbr63pff32kp5jynaqx0w1z91nii-system-shutdown.drv85 /nix/store/mczh1y1dpyyhg5id1dmnqb49h0x5kskc-unit-sshd.service.drv86 /nix/store/qdxyvdgkvwlbrg9kyi0676h45vjb30hk-home-manager-generation.drv87 /nix/store/mdhkvy0x6vk23g181xv5bqq5b0axvwcj-unit-home-manager-tara.service.drv88 /nix/store/mx2zr6234c9w0b54g93h0fif026lklsz-X-Reload-Triggers-systemd-networkd.drv89 /nix/store/ngz7gzj8l8f6dh4w3a68z0l9c99iazg3-unit-systemd-networkd.service.drv90 /nix/store/qqkwphvmbnavmplq21vgyaqasqd77wkc-unit-tor.service.drv91 /nix/store/wc57fgraxksijshq17za9a6kf3ddpwdc-unit-systemd-sysctl.service.drv92 /nix/store/ydinfrga0xap1kciwvmfbsmskdmj0rrd-unit-zerotierone.service.drv93 /nix/store/pjs500m3w98dc3y1a713dpmj5wvh2rg5-system-units.drv94 /nix/store/qr2qinnln2fnjx6q0i5dk3pmgr8g67yy-hosts.drv95 /nix/store/vyvl1hx9g91nrkg1bzxliwib7df0kl96-user-environment.drv96 /nix/store/wx0i45vnqk8nyqyich2lv5frfdwdjxp0-user-generators.drv97 /nix/store/lzb18a21za8z9rj3dwaz74dnjl91i306-etc.drv98 /nix/store/qx0gwjlk8kqigg72vglfa345a7c3x55h-activate.drv99 /nix/store/w9vclh2qxdry9fzp9flpzmvh1mad28l5-nixos-system-galena-26.11.20261002.af0493c.drv100warning: SQLite database '/nix/var/nix/db/db.sqlite' is busy101error: Cannot build '/nix/store/bxwmmqgaaf3p37wfixmqf6c00m4mvcnl-clipboard-jh-0.10.0.drv'.102 Reason: builder failed with exit code 2.103 Output paths:104 /nix/store/ya6hd9wp9zq4q9q9jcilyz2if5703s69-clipboard-jh-0.10.0105 Last 25 log lines:106 > [ 48%] Building CXX object src/cb/CMakeFiles/cb.dir/src/actions/undo.cpp.o107 > [ 49%] Building CXX object src/cb/CMakeFiles/cb.dir/src/actions/redo.cpp.o108 > [ 50%] Linking CXX shared module ../../libcbx11.so109 > [ 52%] Building CXX object src/cb/CMakeFiles/cb.dir/src/actions/script.cpp.o110 > [ 53%] Building CXX object src/cb/CMakeFiles/cb.dir/src/actions/share.cpp.o111 > [ 54%] Building CXX object src/cb/CMakeFiles/cb.dir/src/locales/en_us.cpp.o112 > [ 56%] Building CXX object src/cb/CMakeFiles/cb.dir/src/locales/es_co.cpp.o113 > [ 56%] Built target cbx11114 > [ 57%] Building CXX object src/cb/CMakeFiles/cb.dir/src/locales/es_do.cpp.o115 > [ 58%] Building CXX object src/cb/CMakeFiles/cb.dir/src/locales/pt_br.cpp.o116 > [ 60%] Building CXX object src/cb/CMakeFiles/cb.dir/src/locales/tr_tr.cpp.o117 > [ 61%] Building CXX object src/cb/CMakeFiles/cb.dir/src/locales/de_de.cpp.o118 > [ 62%] Building CXX object src/cb/CMakeFiles/cb.dir/src/locales/fr_fr.cpp.o119 > [ 64%] Building CXX object src/cb/CMakeFiles/cb.dir/src/utils/editors.cpp.o120 > [ 65%] Building CXX object src/cb/CMakeFiles/cb.dir/src/utils/utils.cpp.o121 > [ 66%] Building CXX object src/cb/CMakeFiles/cb.dir/src/utils/formatting.cpp.o122 > [ 68%] Building CXX object src/cb/CMakeFiles/cb.dir/src/utils/files.cpp.o123 > [ 69%] Building CXX object src/cb/CMakeFiles/cb.dir/src/utils/distance.cpp.o124 > [ 70%] Building CXX object src/cb/CMakeFiles/cb.dir/src/utils/directorysize.cpp.o125 > [ 72%] Building CXX object src/cb/CMakeFiles/cb.dir/src/utils/cowcopy.cpp.o126 > [ 73%] Building CXX object src/cb/CMakeFiles/cb.dir/src/platforms/x11wl.cpp.o127 > [ 74%] Building CXX object src/cb/CMakeFiles/cb.dir/src/platforms/linux.cpp.o128 > [ 76%] Linking CXX executable ../../cb129 > [ 76%] Built target cb130 > make: *** [Makefile:136: all] Error 2131 For full logs, run:132 nix log /nix/store/bxwmmqgaaf3p37wfixmqf6c00m4mvcnl-clipboard-jh-0.10.0.drv133error: Cannot build '/nix/store/zpbh1vdsyxn7vylgvfqxnmfg523wjh69-python3.14-ladybug-0.16.0.drv'.134 Reason: builder failed with exit code 1.135 Output paths:136 /nix/store/p4h2643j2w3pwwvs7fc420j929na67b9-python3.14-ladybug-0.16.0-dist137 /nix/store/qanhkvnlpvbl468i05swp73klix5l73k-python3.14-ladybug-0.16.0138 Last 25 log lines:139 > 584 | : ptrans_(ptrans), input_recursion_depth_(0), output_recursion_depth_(0), recursion_limit_(DEFAULT_RECURSION_LIMIT)140 > | ^~~~~~~~~~~~~~~~~~~~~~141 > /build/source/third_party/thrift/protocol/TProtocol.h:584:51: error: class ‘lbug_apache::thrift::protocol::TProtocol’ does not have any field named ‘output_recursion_depth_’142 > 584 | : ptrans_(ptrans), input_recursion_depth_(0), output_recursion_depth_(0), recursion_limit_(DEFAULT_RECURSION_LIMIT)143 > | ^~~~~~~~~~~~~~~~~~~~~~~144 > /build/source/third_party/thrift/protocol/TProtocol.h:584:79: error: class ‘lbug_apache::thrift::protocol::TProtocol’ does not have any field named ‘recursion_limit_’145 > 584 | : ptrans_(ptrans), input_recursion_depth_(0), output_recursion_depth_(0), recursion_limit_(DEFAULT_RECURSION_LIMIT)146 > | ^~~~~~~~~~~~~~~~147 > /build/source/third_party/thrift/protocol/TProtocol.h:584:96: error: ‘DEFAULT_RECURSION_LIMIT’ was not declared in this scope148 > 584 | : ptrans_(ptrans), input_recursion_depth_(0), output_recursion_depth_(0), recursion_limit_(DEFAULT_RECURSION_LIMIT)149 > | ^~~~~~~~~~~~~~~~~~~~~~~150 > /build/source/third_party/thrift/protocol/TProtocol.h: At global scope:151 > /build/source/third_party/thrift/protocol/TProtocol.h:671:1: error: ‘uint32_t’ does not name a type152 > 671 | uint32_t skip(Protocol_& prot, TType type) {153 > | ^~~~~~~~154 > /build/source/third_party/thrift/protocol/TProtocol.h:671:1: note: ‘uint32_t’ is defined in header ‘<cstdint>’; this is probably fixable by adding ‘#include <cstdint>’155 > /build/source/third_party/thrift/protocol/TProtocol.cpp:27:1: error: ‘uint32_t’ does not name a type156 > 27 | uint32_t TProtocol::skip_virt(TType type) {157 > | ^~~~~~~~158 > /build/source/third_party/thrift/protocol/TProtocol.cpp:21:1: note: ‘uint32_t’ is defined in header ‘<cstdint>’; this is probably fixable by adding ‘#include <cstdint>’159 > 20 | #include "protocol/TProtocol.h"160 > +++ |+#include <cstdint>161 > 21 |162 > [230/1057] Building CXX object third_party/antlr4_cypher/CMakeFiles/antlr4_cypher.dir/cypher_parser.cpp.o163 > ninja: build stopped: subcommand failed.164 For full logs, run:165 nix log /nix/store/zpbh1vdsyxn7vylgvfqxnmfg523wjh69-python3.14-ladybug-0.16.0.drv166error: Cannot build '/nix/store/rlbcg7fv610mm3wj4vcd90c6kc9mrqzf-python3.14-cognee-1.1.2.drv'.167 Reason: 1 dependency failed.168 Output paths:169 /nix/store/33nq4xrpdkh7dpsxb621vl1237z8srqf-python3.14-cognee-1.1.2-dist170 /nix/store/zk7xwifqpq272ipbaca85fkrpfymca3k-python3.14-cognee-1.1.2171error: Cannot build '/nix/store/gav70yrp7fy0v4vpk4njk6a1b11v4gbs-cognee.drv'.172 Reason: 1 dependency failed.173 Output paths:174 /nix/store/6i7qk5vll5vsiyplxmwj2gp6rj7jq549-cognee175error: Cannot build '/nix/store/v956hdg9r3pwq387r89gj1p9pqb7876p-home-manager-path.drv'.176 Reason: 1 dependency failed.177 Output paths:178 /nix/store/8bbm66gd8ip5x08h0dfa4kdx5zj6y682-home-manager-path179error: Cannot build '/nix/store/hzfwqcyqfifl9ibbcwgi8i5rd50qych0-hm_hmfontconfigfonts.xml.drv'.180 Reason: 1 dependency failed.181 Output paths:182 /nix/store/w44xq6wgzca3aqcd4nlk5jhd7dkgq8n4-hm_hmfontconfigfonts.xml183error: Cannot build '/nix/store/8g89k23nyg4k9198cdd6vf4r41s76xj8-user-environment.drv'.184 Reason: 1 dependency failed.185 Output paths:186 /nix/store/xbp89rzw95shsa4c4x5s9dlbqh7lr6lk-user-environment187error: Cannot build '/nix/store/p24pglsbk88067kdsdn2azhvx32i8m61-home-manager-files.drv'.188 Reason: 1 dependency failed.189 Output paths:190 /nix/store/779ci9khwzzspabwwipinsbfz5qall59-home-manager-files191error: Cannot build '/nix/store/5685dyf3h774cc1mvxm7yw8h03k8vrsn-hm-putter.json.drv'.192 Reason: 1 dependency failed.193 Output paths:194 /nix/store/4jlkza9067wks3035xig8mac5kyr80qb-hm-putter.json195error: Cannot build '/nix/store/qdxyvdgkvwlbrg9kyi0676h45vjb30hk-home-manager-generation.drv'.196 Reason: 3 dependencies failed.197 Output paths:198 /nix/store/ibwbjqrn5shf7y18zshd4ifvjyxskdz8-home-manager-generation199error: Cannot build '/nix/store/mdhkvy0x6vk23g181xv5bqq5b0axvwcj-unit-home-manager-tara.service.drv'.200 Reason: 1 dependency failed.201 Output paths:202 /nix/store/rdyhjljnfr7s532ylra84slcsj48js9v-unit-home-manager-tara.service203error: Cannot build '/nix/store/2nn1pyd29r5ryn4n706j1w4dr04mnxm3-home-manager-path.drv'.204 Reason: 3 dependencies failed.205 Output paths:206 /nix/store/bfhsnk574w2xwym2iqmmmsmm14k137m2-home-manager-path207error: Cannot build '/nix/store/lph3bnpr2fh61an3rfpfisipibqm58l4-hm_hmfontconfigfonts.xml.drv'.208 Reason: 1 dependency failed.209 Output paths:210 /nix/store/7k6hd0sm4y1b5mg2hc6y877vrxymhm95-hm_hmfontconfigfonts.xml211error: Cannot build '/nix/store/vyvl1hx9g91nrkg1bzxliwib7df0kl96-user-environment.drv'.212 Reason: 1 dependency failed.213 Output paths:214 /nix/store/xzx764v1y789nbnhmj7il896gsyqzj8s-user-environment215error: Cannot build '/nix/store/6fdway03vq14jhcg0kz67jlwxx3vgnh2-home-manager-files.drv'.216 Reason: 1 dependency failed.217 Output paths:218 /nix/store/p4vbrllcjnzppqqh8cgfybh7npvmmk96-home-manager-files219error: Cannot build '/nix/store/7big25gpdnlr8jn8aay4wq58zc4smy0y-hm-putter.json.drv'.220 Reason: 1 dependency failed.221 Output paths:222 /nix/store/ij66y5jimxh2pkh82v03dh0jy397qc6p-hm-putter.json223error: Cannot build '/nix/store/b218srvb1jrm3fbbzimqqlckzvqxlwck-home-manager-generation.drv'.224 Reason: 3 dependencies failed.225 Output paths:226 /nix/store/7md7alm3ws161r20n24rdh5mqgyl9xnp-home-manager-generation227error: Cannot build '/nix/store/61w3bbqrj12f3169cdxchvy4ja6dqpa6-unit-home-manager-cameron.service.drv'.228 Reason: 1 dependency failed.229 Output paths:230 /nix/store/bfy30vq4a1bgqmm6vm6n6dd1i8r08v2f-unit-home-manager-cameron.service231error: Cannot build '/nix/store/pjs500m3w98dc3y1a713dpmj5wvh2rg5-system-units.drv'.232 Reason: 2 dependencies failed.233 Output paths:234 /nix/store/hkziy8bb2sv7vp2ija2yjg3vd1r92dyr-system-units235error: Cannot build '/nix/store/lzb18a21za8z9rj3dwaz74dnjl91i306-etc.drv'.236 Reason: 3 dependencies failed.237 Output paths:238 /nix/store/cs1z4szrmjz95z0ljg0ydzzl4xmbnlw0-etc239error: Cannot build '/nix/store/qx0gwjlk8kqigg72vglfa345a7c3x55h-activate.drv'.240 Reason: 1 dependency failed.241 Output paths:242 /nix/store/rvhbwwmqmhjc6a701wj98sb2rlsrv0qz-activate243error: Cannot build '/nix/store/w9vclh2qxdry9fzp9flpzmvh1mad28l5-nixos-system-galena-26.11.20261002.af0493c.drv'.244 Reason: 2 dependencies failed.245 Output paths:246 /nix/store/5qqqy8992lq90x15dh1ybacvsllyif3s-nixos-system-galena-26.11.20261002.af0493c